BDBM398510 (rac)-{2-[(1-Methoxybutan-2-yl)amino]pyrimidin-5-yl}[4-(7-methoxy-3,4-dihydroisoquinolin-2(1H)-yl)piperidin-1-yl]methanone::US10323020, Example 4
SMILES CCC(COC)Nc1ncc(cn1)C(=O)N1CCC(CC1)N1CCc2ccc(OC)cc2C1
InChI Key InChIKey=ABXSKFQJDIZFGU-UHFFFAOYSA-N
Data  1 IC50
  Tab Delimited (TSV)   2D SDfile   Computed 3D by Vconf -m prep SDfile
Find this compound or compounds like it in BindingDB:
Activity Spreadsheet -- Enzyme Inhibition Constant Data from BindingDB
Found 1 hit for monomerid = 398510
TargetAlpha-2C adrenergic receptor(Homo sapiens (Human))
Bayer Pharma Aktiengesellschaft
US Patent
LigandPNGBDBM398510((rac)-{2-[(1-Methoxybutan-2-yl)amino]pyrimidin-5-y...)
Affinity DataIC50:  5nM. Assay description: Antagonism against the adrenoreceptor α1A was tested using a recombinant human α1A receptor CHO cell line which additionally also recombina...
Ligand InfoPC cidPC sid
In DepthDetails US Patent