BDBM398518 US10323020, Example 12::[4-(3,4-Dihydroisoquinolin-2(1H)-yl)piperidin-1-yl][2-(1,1-dioxidothiomorpholin-4-yl)pyrimidin-5-yl]methanone
SMILES O=C(N1CCC(CC1)N1CCc2ccccc2C1)c1cnc(nc1)N1CCS(=O)(=O)CC1
InChI Key InChIKey=DOQLTUNASFTORE-UHFFFAOYSA-N
Data  1 IC50
  Tab Delimited (TSV)   2D SDfile   Computed 3D by Vconf -m prep SDfile
Find this compound or compounds like it in BindingDB:
Activity Spreadsheet -- Enzyme Inhibition Constant Data from BindingDB
Found 1 hit for monomerid = 398518
TargetAlpha-2C adrenergic receptor(Homo sapiens (Human))
Bayer Pharma Aktiengesellschaft
US Patent
LigandPNGBDBM398518(US10323020, Example 12 | [4-(3,4-Dihydroisoquinoli...)
Affinity DataIC50:  26nM. Assay description: Antagonism against the adrenoreceptor α1A was tested using a recombinant human α1A receptor CHO cell line which additionally also recombina...
Ligand InfoPC cidPC sid
In DepthDetails US Patent