BDBM39881 2,4-dimethyl-2,3-dihydrothieno[3,2-c]quinoline-8-carboxylic acid::MLS000099069::SMR000070072::cid_2861871
SMILES CC1Cc2c(S1)c1cc(ccc1nc2C)C(O)=O
InChI Key InChIKey=NTACNXAPWZLEEF-UHFFFAOYSA-N
Data  4 IC50
  Tab Delimited (TSV)   2D SDfile   Computed 3D by Vconf -m prep SDfile
Find this compound or compounds like it in BindingDB:
Activity Spreadsheet -- Enzyme Inhibition Constant Data from BindingDB
Found 4 hits for monomerid = 39881
Target14-3-3 protein gamma(Homo sapiens (Human))
Emory University
Curated by PubChem BioAssay
LigandPNGBDBM39881(2,4-dimethyl-2,3-dihydrothieno[3,2-c]quinoline-8-c...)
Affinity DataIC50:  2.57E+4nM. Assay description: NIH Molecular Libraries Screening Centers Network [MLSCN] Emory Chemical Biology Discovery Center in MLSCN MLSCN Grant: 1 X01MH78953-01 The 14-3-3 pr...
In DepthDetails PCBioAssay
TargetDNA dC->dU-editing enzyme APOBEC-3A(Homo sapiens (Human))
Burnham Center For Chemical Genomics
Curated by PubChem BioAssay
LigandPNGBDBM39881(2,4-dimethyl-2,3-dihydrothieno[3,2-c]quinoline-8-c...)
Affinity DataIC50:  1.62E+4nMT: 2°C. Assay description: Data Source: Sanford-Burnham Center for Chemical Genomics (SBCCG) Source Affiliation: Sanford-Burnham Medical Research Institute (SBMRI, San Diego, C...
In DepthDetails PCBioAssay
TargetDNA dC->dU-editing enzyme APOBEC-3G(Homo sapiens (Human))
Burnham Center For Chemical Genomics
Curated by PubChem BioAssay
LigandPNGBDBM39881(2,4-dimethyl-2,3-dihydrothieno[3,2-c]quinoline-8-c...)
Affinity DataIC50:  2.63E+4nMT: 2°C. Assay description: Data Source: Sanford-Burnham Center for Chemical Genomics (SBCCG) Source Affiliation: Sanford-Burnham Medical Research Institute (SBMRI, San Diego, C...
In DepthDetails PCBioAssay
TargetNuclear receptor subfamily 4 group A member 1(Homo sapiens (Human))
Burnham Center For Chemical Genomics
Curated by PubChem BioAssay
LigandPNGBDBM39881(2,4-dimethyl-2,3-dihydrothieno[3,2-c]quinoline-8-c...)
Affinity DataIC50: >1.00E+5nM. Assay description: Sanford-Burnham Center for Chemical Genomics (SBCCG) Sanford-Burnham Medical Research Institute (San Diego, CA) NIH Molecular Libraries Screening Cen...
In DepthDetails PCBioAssay