BDBM39885 MLS000119773::N-(2-pyridinylmethyl)-2-(4,5,6,7-tetrahydroindazol-2-yl)acetamide::N-(2-pyridylmethyl)-2-(4,5,6,7-tetrahydroindazol-2-yl)acetamide::N-(pyridin-2-ylmethyl)-2-(4,5,6,7-tetrahydroindazol-2-yl)acetamide::N-(pyridin-2-ylmethyl)-2-(4,5,6,7-tetrahydroindazol-2-yl)ethanamide::SMR000096694::cid_5309885
SMILES O=C(Cn1cc2CCCCc2n1)NCc1ccccn1
InChI Key InChIKey=MGJALTNMTUIGRC-UHFFFAOYSA-N
Data  4 IC50
  Tab Delimited (TSV)   2D SDfile   Computed 3D by Vconf -m prep SDfile
Find this compound or compounds like it in BindingDB:
Activity Spreadsheet -- Enzyme Inhibition Constant Data from BindingDB
Found 4 hits for monomerid = 39885
Target14-3-3 protein gamma(Homo sapiens (Human))
Emory University
Curated by PubChem BioAssay
LigandPNGBDBM39885(MLS000119773 | N-(2-pyridinylmethyl)-2-(4,5,6,7-te...)
Affinity DataIC50:  2.56E+4nM. Assay description: NIH Molecular Libraries Screening Centers Network [MLSCN] Emory Chemical Biology Discovery Center in MLSCN MLSCN Grant: 1 X01MH78953-01 The 14-3-3 pr...
In DepthDetails PCBioAssay
TargetNeutrophil cytosol factor 1 [S99G](Homo sapiens (Human))
Emory University
Curated by PubChem BioAssay
LigandPNGBDBM39885(MLS000119773 | N-(2-pyridinylmethyl)-2-(4,5,6,7-te...)
Affinity DataIC50:  5.00E+4nM. Assay description: NIH Molecular Libraries Screening Centers Network [MLSCN] Emory Chemical Biology Discovery Center in MLSCN Assay provider: Susan Smith, Emory Univers...
In DepthDetails PCBioAssay
TargetKallikrein-5(Homo sapiens (Human))
Pcmd
Curated by PubChem BioAssay
LigandPNGBDBM39885(MLS000119773 | N-(2-pyridinylmethyl)-2-(4,5,6,7-te...)
Affinity DataIC50:  5.00E+4nM. Assay description: Molecular Library Screening Center Network (MLSCN) Penn Center for Molecular Discovery (PCMD) Assay Provider: Scott L. Diamond, University of Pennsy...
In DepthDetails PCBioAssay
TargetGlycoprotein 42(Human herpesvirus 4 type 2)
Emory University
Curated by PubChem BioAssay
LigandPNGBDBM39885(MLS000119773 | N-(2-pyridinylmethyl)-2-(4,5,6,7-te...)
Affinity DataIC50:  1.44E+4nM. Assay description: NIH Molecular Libraries Screening Centers Network [MLSCN] Emory Chemical Biology Discovery Center in MLSCN Assay provider: Theodore Jardetzky; Northw...
In DepthDetails PCBioAssay