BDBM39976 MLS000056383::N-(5-ethylsulfanyl-1,3,4-thiadiazol-2-yl)-2-(furan-2-carbonyl)-3,4-dihydro-1H-isoquinoline-3-carboxamide::N-(5-ethylsulfanyl-1,3,4-thiadiazol-2-yl)-2-(furan-2-ylcarbonyl)-3,4-dihydro-1H-isoquinoline-3-carboxamide::N-[5-(ethylthio)-1,3,4-thiadiazol-2-yl]-2-(2-furoyl)-3,4-dihydro-1H-isoquinoline-3-carboxamide::N-[5-(ethylthio)-1,3,4-thiadiazol-2-yl]-2-[2-furanyl(oxo)methyl]-3,4-dihydro-1H-isoquinoline-3-carboxamide::SMR000067345::cid_2999074
SMILES CCSc1nnc(NC(=O)C2Cc3ccccc3CN2C(=O)c2ccco2)s1
InChI Key InChIKey=QBGVPYUGNGPTQZ-UHFFFAOYSA-N
Data  1 IC50
  Tab Delimited (TSV)   2D SDfile   Computed 3D by Vconf -m prep SDfile
Find this compound or compounds like it in BindingDB:
Activity Spreadsheet -- Enzyme Inhibition Constant Data from BindingDB
Found 1 hit for monomerid = 39976
TargetEstrogen receptor(Homo sapiens (Human))
Emory University
Curated by PubChem BioAssay
LigandPNGBDBM39976(MLS000056383 | N-(5-ethylsulfanyl-1,3,4-thiadiazol...)
Affinity DataIC50:  7.47E+3nM. Assay description: NIH Molecular Libraries Screening Centers Network [MLSCN] Emory Chemical Biology Discovery Center in MLSCN Assay provider: John A. Katzenellenbogen, ...
In DepthDetails PCBioAssay