BDBM39991 3-(3,4-dihydro-1H-isoquinolin-2-ylsulfonyl)benzoic acid [2-(2-furanylmethylamino)-2-oxoethyl] ester::3-(3,4-dihydro-1H-isoquinolin-2-ylsulfonyl)benzoic acid [2-(2-furfurylamino)-2-keto-ethyl] ester::MLS000054069::SMR000061445::[2-(furan-2-ylmethylamino)-2-oxidanylidene-ethyl] 3-(3,4-dihydro-1H-isoquinolin-2-ylsulfonyl)benzoate::[2-(furan-2-ylmethylamino)-2-oxoethyl] 3-(3,4-dihydro-1H-isoquinolin-2-ylsulfonyl)benzoate::cid_2357510
SMILES O=C(COC(=O)c1cccc(c1)S(=O)(=O)N1CCc2ccccc2C1)NCc1ccco1
InChI Key InChIKey=UPRJULRFEWRHNS-UHFFFAOYSA-N
Data  3 IC50
  Tab Delimited (TSV)   2D SDfile   Computed 3D by Vconf -m prep SDfile
Find this compound or compounds like it in BindingDB:
Activity Spreadsheet -- Enzyme Inhibition Constant Data from BindingDB
Found 3 hits for monomerid = 39991
TargetEstrogen receptor(Homo sapiens (Human))
Emory University
Curated by PubChem BioAssay
LigandPNGBDBM39991(3-(3,4-dihydro-1H-isoquinolin-2-ylsulfonyl)benzoic...)
Affinity DataIC50:  2.50E+4nM. Assay description: NIH Molecular Libraries Screening Centers Network [MLSCN] Emory Chemical Biology Discovery Center in MLSCN Assay provider: John A. Katzenellenbogen, ...
In DepthDetails PCBioAssay
TargetEstrogen receptor beta(Homo sapiens (Human))
Emory University
Curated by PubChem BioAssay
LigandPNGBDBM39991(3-(3,4-dihydro-1H-isoquinolin-2-ylsulfonyl)benzoic...)
Affinity DataIC50:  5.00E+4nM. Assay description: NIH Molecular Libraries Screening Centers Network [MLSCN] Emory Chemical Biology Discovery Center in MLSCN Assay provider: John A. Katzenellenbogen, ...
In DepthDetails PCBioAssay
TargetEstrogen receptor beta(Homo sapiens (Human))
Emory University
Curated by PubChem BioAssay
LigandPNGBDBM39991(3-(3,4-dihydro-1H-isoquinolin-2-ylsulfonyl)benzoic...)
Affinity DataIC50:  24.2nM. Assay description: NIH Molecular Libraries Screening Centers Network [MLSCN] Emory Chemical Biology Discovery Center in MLSCN Assay provider: John A. Katzenellenbogen, ...
In DepthDetails PCBioAssay