BDBM400058 7-(2-((3,3-difluoro-1-(methylcarbamoyl)cyclobutyl)amino)-2-oxoacetyl)-6-methyl-N-(3,4,5-trifluorophenyl)-2,3-dihydro-1H-pyrrolizine-5-carboxamide ::US10328053, Compound 36::US10874640, Compound 36::US20230270719, Compound 36
SMILES CNC(=O)C1(CC(F)(F)C1)NC(=O)C(=O)c1c(C)c(C(=O)Nc2cc(F)c(F)c(F)c2)n2CCCc12
InChI Key InChIKey=VYYKUQQLYHPWKI-UHFFFAOYSA-N
Data  3 EC50
  Tab Delimited (TSV)   2D SDfile   Computed 3D by Vconf -m prep SDfile
Find this compound or compounds like it in BindingDB:
Activity Spreadsheet -- Enzyme Inhibition Constant Data from BindingDB
Found 3 hits for monomerid = 400058
TargetSodium/bile acid cotransporter(Homo sapiens (Human))
Gilead Sciences
US Patent
LigandPNGBDBM400058(7-(2-((3,3-difluoro-1-(methylcarbamoyl)cyclobutyl)...)
Affinity DataEC50:  24nM. Assay description: A HepG2 cell line overexpressing the HBV virus attachment receptor sodium-taurocholate cotransporting polypeptide (NTCP) was grown to confluency in D...
Ligand InfoPC cidPC sid
In DepthDetails US Patent
TargetSodium/bile acid cotransporter(Homo sapiens (Human))
Gilead Sciences
US Patent
LigandPNGBDBM400058(7-(2-((3,3-difluoro-1-(methylcarbamoyl)cyclobutyl)...)
Affinity DataEC50:  24nM. Assay description: A HepG2 cell line overexpressing the HBV virus attachment receptor sodium-taurocholate cotransporting polypeptide (NTCP) was grown to confluency in D...
Ligand InfoPC cidPC sid
In DepthDetails US Patent
TargetCapsid protein(Hepatitis B virus genotype C subtype ayr (isolate ...)
Gilead Sciences
US Patent
LigandPNGBDBM400058(7-(2-((3,3-difluoro-1-(methylcarbamoyl)cyclobutyl)...)
Affinity DataEC50:  24nM. Assay description: A HepG2 cell line overexpressing the HBV virus attachment receptor sodium-taurocholate cotransporting polypeptide (NTCP) was grown to confluency in D...
Ligand InfoPC cidPC sid
In DepthDetails US Patent