BDBM40012 (5Z)-5-(3,4-diethoxybenzylidene)-2-(2-furyl)[1,3]thiazolo[3,2-b][1,2,4]triazol-6(5H)-one::5-(3,4-diethoxybenzylidene)-2-(2-furyl)thiazolo[3,2-b][1,2,4]triazol-6-one::5-[(3,4-diethoxyphenyl)methylidene]-2-(2-furanyl)-6-thiazolo[3,2-b][1,2,4]triazolone::5-[(3,4-diethoxyphenyl)methylidene]-2-(furan-2-yl)-[1,3]thiazolo[3,2-b][1,2,4]triazol-6-one::MLS000043561::SMR000020577::cid_3237407
SMILES CCOc1ccc(C=c2sc3nc(nn3c2=O)-c2ccco2)cc1OCC
InChI Key InChIKey=OVDRODOYHTZPRU-UHFFFAOYSA-N
Data  2 IC50  2 EC50
  Tab Delimited (TSV)   2D SDfile   Computed 3D by Vconf -m prep SDfile
Find this compound or compounds like it in BindingDB:
Activity Spreadsheet -- Enzyme Inhibition Constant Data from BindingDB
Found 4 hits for monomerid = 40012
TargetEstrogen receptor(Homo sapiens (Human))
Emory University
Curated by PubChem BioAssay
LigandPNGBDBM40012((5Z)-5-(3,4-diethoxybenzylidene)-2-(2-furyl)[1,3]t...)
Affinity DataIC50: >5.00E+4nM. Assay description: NIH Molecular Libraries Screening Centers Network [MLSCN] Emory Chemical Biology Discovery Center in MLSCN Assay provider: John A. Katzenellenbogen, ...
In DepthDetails PCBioAssay
TargetGenome polyprotein(Hepatitis C virus)
The Scripps Research Institute Molecular Screening Center
Curated by PubChem BioAssay
LigandPNGBDBM40012((5Z)-5-(3,4-diethoxybenzylidene)-2-(2-furyl)[1,3]t...)
Affinity DataIC50:  2.47E+4nM. Assay description: Source (MLPCN Center Name): The Scripps Research Institute Molecular Screening Center (SRIMSC) Center Affiliation: The Scripps Research Institute (TS...
In DepthDetails PCBioAssay
TargetZinc finger protein mex-5(Caenorhabditis elegans)
Broad Institute
Curated by PubChem BioAssay
LigandPNGBDBM40012((5Z)-5-(3,4-diethoxybenzylidene)-2-(2-furyl)[1,3]t...)
Affinity DataEC50:  3.00E+5nM. Assay description: Broad Institute: MLPCN maternal gene expression Project ID: 2024 Keywords: Zinc finger, C. elegans, maternal gene expression, RNA-protein interac...
In DepthDetails PCBioAssay
TargetPOsterior Segregation(Caenorhabditis elegans)
Broad Institute
Curated by PubChem BioAssay
LigandPNGBDBM40012((5Z)-5-(3,4-diethoxybenzylidene)-2-(2-furyl)[1,3]t...)
Affinity DataEC50:  3.00E+5nM. Assay description: Broad Institute: MLPCN maternal gene expression Project ID: 2024 Keywords: Zinc finger, C. elegans, maternal gene expression, RNA-protein interac...
In DepthDetails PCBioAssay