BDBM400141 N-(3,4-difluorophenyl)-7-(2-((1-(dimethylcarbamoyl)-3,3-difluorocyclobutyl)amino)-2-oxoacetyl)-6-methyl-2,3-dihydro-1H-pyrrolizine-5-carboxamide::US10328053, Compound 125::US10874640, Compound 125::US20230270719, Compound 125
SMILES CN(C)C(=O)C1(CC(F)(F)C1)NC(=O)C(=O)c1c(C)c(C(=O)Nc2ccc(F)c(F)c2)n2CCCc12
InChI Key InChIKey=OMYGBVDJKHGCPM-UHFFFAOYSA-N
Data  3 EC50
  Tab Delimited (TSV)   2D SDfile   Computed 3D by Vconf -m prep SDfile
Find this compound or compounds like it in BindingDB:
Activity Spreadsheet -- Enzyme Inhibition Constant Data from BindingDB
Found 3 hits for monomerid = 400141
TargetSodium/bile acid cotransporter(Homo sapiens (Human))
Gilead Sciences
US Patent
LigandPNGBDBM400141(N-(3,4-difluorophenyl)-7-(2-((1-(dimethylcarbamoyl...)
Affinity DataEC50:  23.1nM. Assay description: A HepG2 cell line overexpressing the HBV virus attachment receptor sodium-taurocholate cotransporting polypeptide (NTCP) was grown to confluency in D...
Ligand InfoPC cidPC sid
In DepthDetails US Patent
TargetSodium/bile acid cotransporter(Homo sapiens (Human))
Gilead Sciences
US Patent
LigandPNGBDBM400141(N-(3,4-difluorophenyl)-7-(2-((1-(dimethylcarbamoyl...)
Affinity DataEC50:  23.1nM. Assay description: A HepG2 cell line overexpressing the HBV virus attachment receptor sodium-taurocholate cotransporting polypeptide (NTCP) was grown to confluency in D...
Ligand InfoPC cidPC sid
In DepthDetails US Patent
TargetCapsid protein(Hepatitis B virus genotype C subtype ayr (isolate ...)
Gilead Sciences
US Patent
LigandPNGBDBM400141(N-(3,4-difluorophenyl)-7-(2-((1-(dimethylcarbamoyl...)
Affinity DataEC50:  23.1nM. Assay description: A HepG2 cell line overexpressing the HBV virus attachment receptor sodium-taurocholate cotransporting polypeptide (NTCP) was grown to confluency in D...
Ligand InfoPC cidPC sid
In DepthDetails US Patent