BDBM400156 N-(3,4-difluorophenyl)-6-methyl-7-(2-((3-methyl-1-oxidothietan-3-yl)amino)-2-oxoacetyl)-2,3-dihydro-1H-pyrrolizine-5-carboxamide::US10328053, Compound 145::US10874640, Compound 145::US20230270719, Compound 145
SMILES Cc1c(C(=O)C(=O)NC2(C)CS(=O)C2)c2CCCn2c1C(=O)Nc1ccc(F)c(F)c1
InChI Key InChIKey=HIXLPXCVOTTYCF-UHFFFAOYSA-N
Data  3 EC50
  Tab Delimited (TSV)   2D SDfile   Computed 3D by Vconf -m prep SDfile
Find this compound or compounds like it in BindingDB:
Activity Spreadsheet -- Enzyme Inhibition Constant Data from BindingDB
Found 3 hits for monomerid = 400156
TargetSodium/bile acid cotransporter(Homo sapiens (Human))
Gilead Sciences
US Patent
LigandPNGBDBM400156(N-(3,4-difluorophenyl)-6-methyl-7-(2-((3-methyl-1-...)
Affinity DataEC50:  46.3nM. Assay description: A HepG2 cell line overexpressing the HBV virus attachment receptor sodium-taurocholate cotransporting polypeptide (NTCP) was grown to confluency in D...
Ligand InfoPC cidPC sid
In DepthDetails US Patent
TargetSodium/bile acid cotransporter(Homo sapiens (Human))
Gilead Sciences
US Patent
LigandPNGBDBM400156(N-(3,4-difluorophenyl)-6-methyl-7-(2-((3-methyl-1-...)
Affinity DataEC50:  46.3nM. Assay description: A HepG2 cell line overexpressing the HBV virus attachment receptor sodium-taurocholate cotransporting polypeptide (NTCP) was grown to confluency in D...
Ligand InfoPC cidPC sid
In DepthDetails US Patent
TargetCapsid protein(Hepatitis B virus genotype C subtype ayr (isolate ...)
Gilead Sciences
US Patent
LigandPNGBDBM400156(N-(3,4-difluorophenyl)-6-methyl-7-(2-((3-methyl-1-...)
Affinity DataEC50:  46.3nM. Assay description: A HepG2 cell line overexpressing the HBV virus attachment receptor sodium-taurocholate cotransporting polypeptide (NTCP) was grown to confluency in D...
Ligand InfoPC cidPC sid
In DepthDetails US Patent