BDBM40062 6-bromo-2-{[4-(2-furoyl)-1-piperazinyl]carbonyl}pyrazolo[1,5-a]pyrimidine::MLS000100278::SMR000082324::[4-(6-bromanylpyrazolo[1,5-a]pyrimidin-2-yl)carbonylpiperazin-1-yl]-(furan-2-yl)methanone::[4-(6-bromopyrazolo[1,5-a]pyrimidine-2-carbonyl)piperazin-1-yl]-(furan-2-yl)methanone::[4-(6-bromopyrazolo[1,5-a]pyrimidine-2-carbonyl)piperazino]-(2-furyl)methanone::[4-[(6-bromo-2-pyrazolo[1,5-a]pyrimidinyl)-oxomethyl]-1-piperazinyl]-(2-furanyl)methanone::cid_2237247
SMILES Brc1cnc2cc(nn2c1)C(=O)N1CCN(CC1)C(=O)c1ccco1
InChI Key InChIKey=JYMATOLOUZWCRG-UHFFFAOYSA-N
Data  4 IC50  1 EC50
  Tab Delimited (TSV)   2D SDfile   Computed 3D by Vconf -m prep SDfile
Find this compound or compounds like it in BindingDB:
Activity Spreadsheet -- Enzyme Inhibition Constant Data from BindingDB
Found 5 hits for monomerid = 40062
TargetEstrogen receptor(Homo sapiens (Human))
Emory University
Curated by PubChem BioAssay
LigandPNGBDBM40062(6-bromo-2-{[4-(2-furoyl)-1-piperazinyl]carbonyl}py...)
Affinity DataIC50:  1.79E+4nM. Assay description: NIH Molecular Libraries Screening Centers Network [MLSCN] Emory Chemical Biology Discovery Center in MLSCN Assay provider: John A. Katzenellenbogen, ...
In DepthDetails PCBioAssay
TargetEstrogen receptor beta(Homo sapiens (Human))
Nmmlsc
Curated by PubChem BioAssay
LigandPNGBDBM40062(6-bromo-2-{[4-(2-furoyl)-1-piperazinyl]carbonyl}py...)
Affinity DataEC50:  2.73nM. Assay description: University of New Mexico Assay Overview: Assay Support: 1X01 MH077627-01 Assay for Ligands of GPR30 and Classical Estrogen Receptors PI: Eric Prossni...
In DepthDetails PCBioAssay
TargetCarboxy-terminal domain RNA polymerase II polypeptide A small phosphatase 1(Homo sapiens (Human))
Burnham Center For Chemical Genomics
Curated by PubChem BioAssay
LigandPNGBDBM40062(6-bromo-2-{[4-(2-furoyl)-1-piperazinyl]carbonyl}py...)
Affinity DataIC50:  1.65E+4nM. Assay description: Data Source: Sanford-Burnham Center for Chemical Genomics (SBCCG) Source Affiliation: Sanford-Burnham Medical Research Institute (SBMRI, San Diego, C...
In DepthDetails PCBioAssay
TargetEstrogen receptor beta(Homo sapiens (Human))
Nmmlsc
Curated by PubChem BioAssay
LigandPNGBDBM40062(6-bromo-2-{[4-(2-furoyl)-1-piperazinyl]carbonyl}py...)
Affinity DataIC50:  2.73E+3nM. Assay description: NIH Molecular Libraries Screening Centers Network [MLSCN] Emory Chemical Biology Discovery Center in MLSCN Assay provider: John A. Katzenellenbogen, ...
In DepthDetails PCBioAssay
TargetEstrogen receptor beta(Homo sapiens (Human))
Nmmlsc
Curated by PubChem BioAssay
LigandPNGBDBM40062(6-bromo-2-{[4-(2-furoyl)-1-piperazinyl]carbonyl}py...)
Affinity DataIC50:  349nM. Assay description: NIH Molecular Libraries Screening Centers Network [MLSCN] Emory Chemical Biology Discovery Center in MLSCN Assay provider: John A. Katzenellenbogen, ...
In DepthDetails PCBioAssay