BDBM400988 US10005735, Compound 1
SMILES NC(=O)c1cnc2c(S)cccc2c1
InChI Key InChIKey=ODCXMTQOJBFEFL-UHFFFAOYSA-N
Data  3 IC50
  Tab Delimited (TSV)   2D SDfile   Computed 3D by Vconf -m prep SDfile
Find this compound or compounds like it in BindingDB:
Activity Spreadsheet -- Enzyme Inhibition Constant Data from BindingDB
Found 3 hits for monomerid = 400988
Target26S proteasome non-ATPase regulatory subunit 14(Homo sapiens (Human))
California Institute Of Technology
US Patent
LigandPNGBDBM400988(US10005735, Compound 1)
Affinity DataIC50:  1.00E+3nM. Assay description: In brief, this Rpn11 bioassay employs a fluorescent polarization readout based on the ability of the 26S proteasome to cleave the protein substrate i...
Ligand InfoPC cidPC sid
In DepthDetails US Patent
TargetAMSH-like protease(Homo sapiens (Human))
California Institute Of Technology
US Patent
LigandPNGBDBM400988(US10005735, Compound 1)
Affinity DataIC50:  1.20E+3nM. Assay description: In brief, this Rpn11 bioassay employs a fluorescent polarization readout based on the ability of the 26S proteasome to cleave the protein substrate i...
Ligand InfoPC cidPC sid
In DepthDetails US Patent
TargetCOP9 signalosome complex subunit 5(Homo sapiens (Human))
California Institute Of Technology
US Patent
LigandPNGBDBM400988(US10005735, Compound 1)
Affinity DataIC50:  1.50E+4nM. Assay description: In brief, this Rpn11 bioassay employs a fluorescent polarization readout based on the ability of the 26S proteasome to cleave the protein substrate i...
Ligand InfoPC cidPC sid
In DepthDetails US Patent