BDBM401317 US10005762, Example 1
SMILES CSC[C@H](N)[C@](O)(Cc1cc(CCCC2CC2)c(C)cn1)C(O)=O
InChI Key InChIKey=VLBZWEZIKXOCHS-FUHWJXTLSA-N
Data  2 IC50
  Tab Delimited (TSV)   2D SDfile   Computed 3D by Vconf -m prep SDfile
Find this compound or compounds like it in BindingDB:
Activity Spreadsheet -- Enzyme Inhibition Constant Data from BindingDB
Found 2 hits for monomerid = 401317
TargetLeucyl-cystinyl aminopeptidase(Homo sapiens (Human))
Astellas Pharma
US Patent
LigandPNGBDBM401317(US10005762, Example 1)
Affinity DataIC50:  3.40nM. Assay description: The inventors have assumed that inhibition of nocturnal activity of placental leucine aminopeptidase (P-LAP), i.e. aminopeptidase that cleaves AVP, w...
Ligand InfoPC cidPC sid
In DepthDetails US Patent
TargetLeucyl-cystinyl aminopeptidase(Rattus norvegicus)
Astellas Pharma
US Patent
LigandPNGBDBM401317(US10005762, Example 1)
Affinity DataIC50:  1.70nM. Assay description: The inventors have assumed that inhibition of nocturnal activity of placental leucine aminopeptidase (P-LAP), i.e. aminopeptidase that cleaves AVP, w...
Ligand InfoPC cidPC sid
In DepthDetails US Patent