BDBM40238 2-(4-acetylanilino)-1-(4-phenyl-1-piperazinyl)ethanone::2-(4-acetylanilino)-1-(4-phenylpiperazin-1-yl)ethanone::2-(4-acetylanilino)-1-(4-phenylpiperazino)ethanone::2-[(4-ethanoylphenyl)amino]-1-(4-phenylpiperazin-1-yl)ethanone::MLS000568168::SMR000154490::cid_2450811
SMILES CC(=O)c1ccc(NCC(=O)N2CCN(CC2)c2ccccc2)cc1
InChI Key InChIKey=VZYXBVVJRMQQME-UHFFFAOYSA-N
Data  5 IC50
  Tab Delimited (TSV)   2D SDfile   Computed 3D by Vconf -m prep SDfile
Find this compound or compounds like it in BindingDB:
Activity Spreadsheet -- Enzyme Inhibition Constant Data from BindingDB
Found 5 hits for monomerid = 40238
TargetFocal adhesion kinase 1(Homo sapiens (Human))
The Scripps Research Institute Molecular Screening Center
Curated by PubChem BioAssay
LigandPNGBDBM40238(2-(4-acetylanilino)-1-(4-phenyl-1-piperazinyl)etha...)
Affinity DataIC50:  2.34E+4nM. Assay description: Source (MLSCN Center Name): The Scripps Research Institute Molecular Screening Center Center Affiliation: The Scripps Research Institute, TSRI Assa...
In DepthDetails PCBioAssay
TargetEstrogen receptor(Homo sapiens (Human))
Emory University
Curated by PubChem BioAssay
LigandPNGBDBM40238(2-(4-acetylanilino)-1-(4-phenyl-1-piperazinyl)etha...)
Affinity DataIC50:  5.02E+3nM. Assay description: NIH Molecular Libraries Screening Centers Network [MLSCN] Emory Chemical Biology Discovery Center in MLSCN Assay provider: John A. Katzenellenbogen, ...
In DepthDetails PCBioAssay
TargetEstrogen receptor beta(Homo sapiens (Human))
Emory University
Curated by PubChem BioAssay
LigandPNGBDBM40238(2-(4-acetylanilino)-1-(4-phenyl-1-piperazinyl)etha...)
Affinity DataIC50:  2.64E+3nM. Assay description: NIH Molecular Libraries Screening Centers Network [MLSCN] Emory Chemical Biology Discovery Center in MLSCN Assay provider: John A. Katzenellenbogen, ...
In DepthDetails PCBioAssay
TargetEstrogen receptor beta(Homo sapiens (Human))
Emory University
Curated by PubChem BioAssay
LigandPNGBDBM40238(2-(4-acetylanilino)-1-(4-phenyl-1-piperazinyl)etha...)
Affinity DataIC50:  3.71E+4nM. Assay description: NIH Molecular Libraries Screening Centers Network [MLSCN] Emory Chemical Biology Discovery Center in MLSCN Assay provider: John A. Katzenellenbogen, ...
In DepthDetails PCBioAssay
TargetProtein-tyrosine kinase 2-beta(Homo sapiens (Human))
The Scripps Research Institute Molecular Screening Center
Curated by PubChem BioAssay
LigandPNGBDBM40238(2-(4-acetylanilino)-1-(4-phenyl-1-piperazinyl)etha...)
Affinity DataIC50: >6.95E+4nM. Assay description: Source (MLPCN Center Name): The Scripps Research Institute Molecular Screening Center (SRIMSC) Affiliation: The Scripps Research Institute, TSRI Assa...
In DepthDetails PCBioAssay