BDBM402425 US10329291, Example 16
SMILES CN1C(=N)N[C@]2(CCC[C@H]2S1(=O)=O)c1cc(NC(=O)c2cnc(OCC(F)(F)F)cn2)ccc1F
InChI Key InChIKey=YIDXBFWAHSQOLK-DNVCBOLYSA-N
Data  2 KI
  Tab Delimited (TSV)   2D SDfile   Computed 3D by Vconf -m prep SDfile
Find this compound or compounds like it in BindingDB:
Activity Spreadsheet -- Enzyme Inhibition Constant Data from BindingDB
Found 2 hits for monomerid = 402425
TargetBeta-secretase 1(Homo sapiens (Human))
TBA
US Patent
LigandPNGBDBM402425(US10329291, Example 16)
Affinity DataKi:  7nM. Assay description: The compounds of the invention were assessed for their ability to inhibit BACE-1 using the following assay. The resulting values are reported in the ...
Ligand InfoPC cidPC sid
In DepthDetails US Patent
TargetBeta-secretase 2(Homo sapiens (Human))
TBA
US Patent
LigandPNGBDBM402425(US10329291, Example 16)
Affinity DataKi:  25nM. Assay description: The compounds of the invention were assessed for their ability to inhibit BACE-1 using the following assay. The resulting values are reported in the ...
Ligand InfoPC cidPC sid
In DepthDetails US Patent