BDBM40262 5,6-dihydro-4H-cyclopenta[b]thiophen-2-yl-[4-(2-methoxyphenyl)-1-piperazinyl]methanone::5,6-dihydro-4H-cyclopenta[b]thiophen-2-yl-[4-(2-methoxyphenyl)piperazin-1-yl]methanone::5,6-dihydro-4H-cyclopenta[b]thiophen-2-yl-[4-(2-methoxyphenyl)piperazino]methanone::MLS000566740::SMR000153697::cid_2566372
SMILES COc1ccccc1N1CCN(CC1)C(=O)c1cc2CCCc2s1
InChI Key InChIKey=GLAOCXAZECLJMA-UHFFFAOYSA-N
Data  2 IC50
  Tab Delimited (TSV)   2D SDfile   Computed 3D by Vconf -m prep SDfile
Find this compound or compounds like it in BindingDB:
Activity Spreadsheet -- Enzyme Inhibition Constant Data from BindingDB
Found 2 hits for monomerid = 40262
TargetNuclear receptor subfamily 4 group A member 1(Homo sapiens (Human))
Burnham Center For Chemical Genomics
Curated by PubChem BioAssay
LigandPNGBDBM40262(5,6-dihydro-4H-cyclopenta[b]thiophen-2-yl-[4-(2-me...)
Affinity DataIC50:  3.66E+4nM. Assay description: Sanford-Burnham Center for Chemical Genomics (SBCCG) Sanford-Burnham Medical Research Institute (San Diego, CA) NIH Molecular Libraries Screening Cen...
In DepthDetails PCBioAssay
TargetEstrogen receptor(Homo sapiens (Human))
Emory University
Curated by PubChem BioAssay
LigandPNGBDBM40262(5,6-dihydro-4H-cyclopenta[b]thiophen-2-yl-[4-(2-me...)
Affinity DataIC50:  5.19E+3nM. Assay description: NIH Molecular Libraries Screening Centers Network [MLSCN] Emory Chemical Biology Discovery Center in MLSCN Assay provider: John A. Katzenellenbogen, ...
In DepthDetails PCBioAssay