BDBM40267 MLS000029283::N-(3-Cyano-4,5-dimethyl-thiophen-2-yl)-2-(5-phenyl-[1,3,4]oxadiazol-2-ylsulfanyl)-acetamide::N-(3-cyano-4,5-dimethyl-2-thienyl)-2-[(5-phenyl-1,3,4-oxadiazol-2-yl)thio]acetamide::N-(3-cyano-4,5-dimethyl-2-thiophenyl)-2-[(5-phenyl-1,3,4-oxadiazol-2-yl)thio]acetamide::N-(3-cyano-4,5-dimethyl-thiophen-2-yl)-2-[(5-phenyl-1,3,4-oxadiazol-2-yl)sulfanyl]ethanamide::N-(3-cyano-4,5-dimethylthiophen-2-yl)-2-[(5-phenyl-1,3,4-oxadiazol-2-yl)sulfanyl]acetamide::SMR000001724::cid_645191
SMILES Cc1sc(NC(=O)CSc2nnc(o2)-c2ccccc2)c(C#N)c1C
InChI Key InChIKey=HGIVTQHWIGAJIC-UHFFFAOYSA-N
Data  1 IC50
  Tab Delimited (TSV)   2D SDfile   Computed 3D by Vconf -m prep SDfile
Find this compound or compounds like it in BindingDB:
Activity Spreadsheet -- Enzyme Inhibition Constant Data from BindingDB
Found 1 hit for monomerid = 40267
TargetUbiquitin carboxyl-terminal hydrolase BAP1(Homo sapiens (Human))
Emory University
Curated by PubChem BioAssay
LigandPNGBDBM40267(MLS000029283 | N-(3-Cyano-4,5-dimethyl-thiophen-2-...)
Affinity DataIC50:  4.48E+4nM. Assay description: NIH Molecular Libraries Screening Centers Network [MLSCN] Emory Chemical Biology Discovery Center in MLSCN Assay provider: Keith D. Wilkinson, Emory ...
In DepthDetails PCBioAssay