BDBM40279 MLS000027775::N-(3-Cyano-4,5-dimethyl-thiophen-2-yl)-2-(5-phenyl-thiazolo[2,3-c][1,2,4]triazol-3-ylsulfanyl)-acetamide::N-(3-cyano-4,5-dimethyl-2-thienyl)-2-[(5-phenylthiazolo[2,3-c][1,2,4]triazol-3-yl)thio]acetamide::N-(3-cyano-4,5-dimethyl-2-thiophenyl)-2-[(5-phenyl-3-thiazolo[2,3-c][1,2,4]triazolyl)thio]acetamide::N-(3-cyano-4,5-dimethyl-thiophen-2-yl)-2-[(5-phenyl-[1,3]thiazolo[2,3-c][1,2,4]triazol-3-yl)sulfanyl]ethanamide::N-(3-cyano-4,5-dimethylthiophen-2-yl)-2-[(5-phenyl-[1,3]thiazolo[2,3-c][1,2,4]triazol-3-yl)sulfanyl]acetamide::SMR000007129::cid_653904
SMILES Cc1sc(NC(=O)CSc2nnc3scc(-c4ccccc4)n23)c(C#N)c1C
InChI Key InChIKey=QZBSJZWPFXECCH-UHFFFAOYSA-N
Data  1 IC50
  Tab Delimited (TSV)   2D SDfile   Computed 3D by Vconf -m prep SDfile
Find this compound or compounds like it in BindingDB:
Activity Spreadsheet -- Enzyme Inhibition Constant Data from BindingDB
Found 1 hit for monomerid = 40279
TargetUbiquitin carboxyl-terminal hydrolase BAP1(Homo sapiens (Human))
Emory University
Curated by PubChem BioAssay
LigandPNGBDBM40279(MLS000027775 | N-(3-Cyano-4,5-dimethyl-thiophen-2-...)
Affinity DataIC50: >5.00E+4nM. Assay description: NIH Molecular Libraries Screening Centers Network [MLSCN] Emory Chemical Biology Discovery Center in MLSCN Assay provider: Keith D. Wilkinson, Emory ...
In DepthDetails PCBioAssay