BDBM40294 3-(3-chloranyl-4-methyl-phenyl)-8-(3,4-dimethoxyphenyl)-6-oxidanylidene-2,4,7,8-tetrahydropyrido[2,1-b][1,3,5]thiadiazine-9-carbonitrile::3-(3-chloro-4-methyl-phenyl)-8-(3,4-dimethoxyphenyl)-6-keto-2,4,7,8-tetrahydropyrido[2,1-b][1,3,5]thiadiazine-9-carbonitrile::3-(3-chloro-4-methylphenyl)-8-(3,4-dimethoxyphenyl)-6-oxo-2,4,7,8-tetrahydropyrido[2,1-b][1,3,5]thiadiazine-9-carbonitrile::MLS000117236::SMR000094189::cid_5307404
SMILES COc1ccc(cc1OC)C1CC(=O)N2CN(CSC2=C1C#N)c1ccc(C)c(Cl)c1
InChI Key InChIKey=PCNJDSLBOCZXGV-UHFFFAOYSA-N
Data  2 IC50
  Tab Delimited (TSV)   2D SDfile   Computed 3D by Vconf -m prep SDfile
Find this compound or compounds like it in BindingDB:
Activity Spreadsheet -- Enzyme Inhibition Constant Data from BindingDB
Found 2 hits for monomerid = 40294
TargetVoltage-dependent N-type calcium channel subunit alpha-1B(Homo sapiens (Human))
Burnham Center For Chemical Genomics
Curated by PubChem BioAssay
LigandPNGBDBM40294(3-(3-chloranyl-4-methyl-phenyl)-8-(3,4-dimethoxyph...)
Affinity DataIC50:  5.68E+4nM. Assay description: Data Source: Data Source: Sanford-Burnham Center for Chemical Genomics (SBCCG) Source Affiliation: Sanford-Burnham Medical Research Institute Network...
In DepthDetails PCBioAssay
TargetUbiquitin carboxyl-terminal hydrolase BAP1(Homo sapiens (Human))
Emory University
Curated by PubChem BioAssay
LigandPNGBDBM40294(3-(3-chloranyl-4-methyl-phenyl)-8-(3,4-dimethoxyph...)
Affinity DataIC50: >5.00E+4nM. Assay description: NIH Molecular Libraries Screening Centers Network [MLSCN] Emory Chemical Biology Discovery Center in MLSCN Assay provider: Keith D. Wilkinson, Emory ...
In DepthDetails PCBioAssay