BDBM40299 4-ethyl-5-methyl-2-(2-thenoylamino)thiophene-3-carboxylic acid ethyl ester::4-ethyl-5-methyl-2-[[oxo(thiophen-2-yl)methyl]amino]-3-thiophenecarboxylic acid ethyl ester::MLS000107977::SMR000103941::cid_868688::ethyl 4-ethyl-5-methyl-2-(thiophen-2-ylcarbonylamino)thiophene-3-carboxylate::ethyl 4-ethyl-5-methyl-2-(thiophene-2-carbonylamino)thiophene-3-carboxylate
SMILES CCOC(=O)c1c(NC(=O)c2cccs2)sc(C)c1CC
InChI Key InChIKey=MNIRUSQTAOVRIE-UHFFFAOYSA-N
Data  1 IC50
  Tab Delimited (TSV)   2D SDfile   Computed 3D by Vconf -m prep SDfile
Find this compound or compounds like it in BindingDB:
Activity Spreadsheet -- Enzyme Inhibition Constant Data from BindingDB
Found 1 hit for monomerid = 40299
TargetUbiquitin carboxyl-terminal hydrolase BAP1(Homo sapiens (Human))
Emory University
Curated by PubChem BioAssay
LigandPNGBDBM40299(4-ethyl-5-methyl-2-(2-thenoylamino)thiophene-3-car...)
Affinity DataIC50:  3.04E+4nM. Assay description: NIH Molecular Libraries Screening Centers Network [MLSCN] Emory Chemical Biology Discovery Center in MLSCN Assay provider: Keith D. Wilkinson, Emory ...
In DepthDetails PCBioAssay