BDBM40345 4-(diethylsulfamoyl)-N-(2-morpholin-4-yl-2-thiophen-2-yl-ethyl)benzamide;hydrochloride::4-(diethylsulfamoyl)-N-(2-morpholin-4-yl-2-thiophen-2-ylethyl)benzamide;hydrochloride::4-(diethylsulfamoyl)-N-[2-(4-morpholinyl)-2-thiophen-2-ylethyl]benzamide;hydrochloride::4-(diethylsulfamoyl)-N-[2-morpholino-2-(2-thienyl)ethyl]benzamide;hydrochloride::MLS000098039::SMR000065688::cid_6603385
SMILES CCN(CC)S(=O)(=O)c1ccc(cc1)C(=O)NCC(N1CCOCC1)c1cccs1
InChI Key InChIKey=BVNVBSOEFMFBJH-UHFFFAOYSA-N
Data  1 IC50
  Tab Delimited (TSV)   2D SDfile   Computed 3D by Vconf -m prep SDfile
Find this compound or compounds like it in BindingDB:
Activity Spreadsheet -- Enzyme Inhibition Constant Data from BindingDB
Found 1 hit for monomerid = 40345
TargetCoagulation factor XII(Homo sapiens (Human))
Pcmd
Curated by PubChem BioAssay
LigandPNGBDBM40345(4-(diethylsulfamoyl)-N-(2-morpholin-4-yl-2-thiophe...)
Affinity DataIC50: >5.00E+4nM. Assay description: Molecular Library Screening Center Network (MLSCN) Penn Center for Molecular Discovery (PCMD) Assay Provider: Scott L. Diamond, University of Pennsy...
In DepthDetails PCBioAssay