BDBM403456 US10335399, Example 2-3A::US10806724, Example 2-3A
SMILES NC(=O)c1cc(c2CC[C@@H](Oc2n1)C1CC1)-c1ccc(F)cc1F
InChI Key InChIKey=RBAFSCZAVGQDEO-MRXNPFEDSA-N
Data  2 IC50
  Tab Delimited (TSV)   2D SDfile   Computed 3D by Vconf -m prep SDfile
Find this compound or compounds like it in BindingDB:
Activity Spreadsheet -- Enzyme Inhibition Constant Data from BindingDB
Found 2 hits for monomerid = 403456
TargetMetabotropic glutamate receptor 2(Homo sapiens (Human))
Merck Sharp & Dohme
US Patent
LigandPNGBDBM403456(US10335399, Example 2-3A | US10806724, Example 2-3...)
Affinity DataIC50:  20nM. Assay description: The utility of the compounds of the invention as an inhibitor of metabotropic glutamate receptor activity, in particular mGluR2 activity, may be demo...
Ligand InfoPC cidPC sid
In DepthDetails US Patent
TargetMetabotropic glutamate receptor 2(Homo sapiens (Human))
Merck Sharp & Dohme
US Patent
LigandPNGBDBM403456(US10335399, Example 2-3A | US10806724, Example 2-3...)
Affinity DataIC50:  20nM. Assay description: The utility of the compounds of the invention as an inhibitor of metabotropic glutamate receptor activity, in particular mGluR2 activity, may be demo...
Ligand InfoPC cidPC sid
In DepthDetails US Patent