BDBM40346 2-[[4-amino-5-(3,4-dimethoxyphenyl)-1,2,4-triazol-3-yl]sulfanyl]-N-(5-methyl-1,2-oxazol-3-yl)acetamide::2-[[4-amino-5-(3,4-dimethoxyphenyl)-1,2,4-triazol-3-yl]thio]-N-(5-methyl-3-isoxazolyl)acetamide::2-[[4-amino-5-(3,4-dimethoxyphenyl)-1,2,4-triazol-3-yl]thio]-N-(5-methylisoxazol-3-yl)acetamide::2-[[4-azanyl-5-(3,4-dimethoxyphenyl)-1,2,4-triazol-3-yl]sulfanyl]-N-(5-methyl-1,2-oxazol-3-yl)ethanamide::MLS000097797::SMR000063983::cid_2078706
SMILES COc1ccc(cc1OC)-c1nnc(SCC(=O)Nc2cc(C)on2)n1N
InChI Key InChIKey=RFDRLOHWIWKODP-UHFFFAOYSA-N
Data  1 IC50
  Tab Delimited (TSV)   2D SDfile   Computed 3D by Vconf -m prep SDfile
Find this compound or compounds like it in BindingDB:
Activity Spreadsheet -- Enzyme Inhibition Constant Data from BindingDB
Found 1 hit for monomerid = 40346
TargetCoagulation factor XII(Homo sapiens (Human))
Pcmd
Curated by PubChem BioAssay
LigandPNGBDBM40346(2-[[4-amino-5-(3,4-dimethoxyphenyl)-1,2,4-triazol-...)
Affinity DataIC50: >5.00E+4nM. Assay description: Molecular Library Screening Center Network (MLSCN) Penn Center for Molecular Discovery (PCMD) Assay Provider: Scott L. Diamond, University of Pennsy...
In DepthDetails PCBioAssay