BDBM40350 MLS000057539::N-(6-methoxy-3-pyridinyl)-2-(1-piperidinyl)-5-(1-piperidinylsulfonyl)benzamide::N-(6-methoxy-3-pyridyl)-2-piperidino-5-piperidinosulfonyl-benzamide::N-(6-methoxypyridin-3-yl)-2-piperidin-1-yl-5-piperidin-1-ylsulfonyl-benzamide::N-(6-methoxypyridin-3-yl)-2-piperidin-1-yl-5-piperidin-1-ylsulfonylbenzamide::SMR000064341::cid_2093033
SMILES COc1ccc(NC(=O)c2cc(ccc2N2CCCCC2)S(=O)(=O)N2CCCCC2)cn1
InChI Key InChIKey=WDHXJJDMPBYSPB-UHFFFAOYSA-N
Data  1 IC50
  Tab Delimited (TSV)   2D SDfile   Computed 3D by Vconf -m prep SDfile
Find this compound or compounds like it in BindingDB:
Activity Spreadsheet -- Enzyme Inhibition Constant Data from BindingDB
Found 1 hit for monomerid = 40350
TargetCoagulation factor XII(Homo sapiens (Human))
Pcmd
Curated by PubChem BioAssay
LigandPNGBDBM40350(MLS000057539 | N-(6-methoxy-3-pyridinyl)-2-(1-pipe...)
Affinity DataIC50: >5.00E+4nM. Assay description: Molecular Library Screening Center Network (MLSCN) Penn Center for Molecular Discovery (PCMD) Assay Provider: Scott L. Diamond, University of Pennsy...
In DepthDetails PCBioAssay