BDBM40359 4-(1-methyl-3-indolyl)-N-propan-2-ylbutanamide::4-(1-methylindol-3-yl)-N-propan-2-yl-butanamide::4-(1-methylindol-3-yl)-N-propan-2-ylbutanamide::MLS000096057::N-isopropyl-4-(1-methyl-1H-indol-3-yl)butanamide::N-isopropyl-4-(1-methylindol-3-yl)butyramide::SMR000032005::cid_3238185
SMILES CC(C)NC(=O)CCCc1cn(C)c2ccccc12
InChI Key InChIKey=KBGBJGTYOSDAFM-UHFFFAOYSA-N
Data  1 IC50
  Tab Delimited (TSV)   2D SDfile   Computed 3D by Vconf -m prep SDfile
Find this compound or compounds like it in BindingDB:
Activity Spreadsheet -- Enzyme Inhibition Constant Data from BindingDB
Found 1 hit for monomerid = 40359
TargetCoagulation factor XII(Homo sapiens (Human))
Pcmd
Curated by PubChem BioAssay
LigandPNGBDBM40359(4-(1-methyl-3-indolyl)-N-propan-2-ylbutanamide | 4...)
Affinity DataIC50: >5.00E+4nM. Assay description: Molecular Library Screening Center Network (MLSCN) Penn Center for Molecular Discovery (PCMD) Assay Provider: Scott L. Diamond, University of Pennsy...
In DepthDetails PCBioAssay