BDBM40386 MLS000065916::N-[1-(1,3-benzodioxol-5-yl)ethyl]-3,5-dimethyl-1,2-oxazole-4-carboxamide::N-[1-(1,3-benzodioxol-5-yl)ethyl]-3,5-dimethyl-4-isoxazolecarboxamide::N-[1-(1,3-benzodioxol-5-yl)ethyl]-3,5-dimethyl-isoxazole-4-carboxamide::SMR000080639::cid_2971164
SMILES CC(NC(=O)c1c(C)noc1C)c1ccc2OCOc2c1
InChI Key InChIKey=HGMMLVXDYWALMS-UHFFFAOYSA-N
Data  1 IC50
  Tab Delimited (TSV)   2D SDfile   Computed 3D by Vconf -m prep SDfile
Find this compound or compounds like it in BindingDB:
Activity Spreadsheet -- Enzyme Inhibition Constant Data from BindingDB
Found 1 hit for monomerid = 40386
TargetCoagulation factor XII(Homo sapiens (Human))
Pcmd
Curated by PubChem BioAssay
LigandPNGBDBM40386(MLS000065916 | N-[1-(1,3-benzodioxol-5-yl)ethyl]-3...)
Affinity DataIC50: >5.00E+4nM. Assay description: Molecular Library Screening Center Network (MLSCN) Penn Center for Molecular Discovery (PCMD) Assay Provider: Scott L. Diamond, University of Pennsy...
In DepthDetails PCBioAssay