BDBM40390 MLS000115020::SMR000092276::[4-(4-methoxyphenyl)-1-piperazinyl]-(5-methyl-3-phenyl-4-isoxazolyl)methanone::[4-(4-methoxyphenyl)piperazin-1-yl]-(5-methyl-3-phenyl-1,2-oxazol-4-yl)methanone::[4-(4-methoxyphenyl)piperazino]-(5-methyl-3-phenyl-isoxazol-4-yl)methanone::cid_1094864
SMILES COc1ccc(cc1)N1CCN(CC1)C(=O)c1c(C)onc1-c1ccccc1
InChI Key InChIKey=QOEOKUAZHXOIRZ-UHFFFAOYSA-N
Data  1 IC50
  Tab Delimited (TSV)   2D SDfile   Computed 3D by Vconf -m prep SDfile
Find this compound or compounds like it in BindingDB:
Activity Spreadsheet -- Enzyme Inhibition Constant Data from BindingDB
Found 1 hit for monomerid = 40390
TargetCoagulation factor XII(Homo sapiens (Human))
Pcmd
Curated by PubChem BioAssay
LigandPNGBDBM40390(MLS000115020 | SMR000092276 | [4-(4-methoxyphenyl)...)
Affinity DataIC50: >5.00E+4nM. Assay description: Molecular Library Screening Center Network (MLSCN) Penn Center for Molecular Discovery (PCMD) Assay Provider: Scott L. Diamond, University of Pennsy...
In DepthDetails PCBioAssay