BDBM40482 1-(2-Methyl-2,3-dihydro-indol-1-yl)-2-{5-[4-(pyrrolidine-1-sulfonyl)-phenyl]-[1,3,4]oxadiazol-2-ylsulfanyl}-ethanone::1-(2-methyl-2,3-dihydroindol-1-yl)-2-[[5-(4-pyrrolidin-1-ylsulfonylphenyl)-1,3,4-oxadiazol-2-yl]sulfanyl]ethanone::1-(2-methyl-2,3-dihydroindol-1-yl)-2-[[5-[4-(1-pyrrolidinylsulfonyl)phenyl]-1,3,4-oxadiazol-2-yl]thio]ethanone::1-(2-methylindolin-1-yl)-2-[[5-(4-pyrrolidinosulfonylphenyl)-1,3,4-oxadiazol-2-yl]thio]ethanone::MLS000077353::SMR000002593::cid_648808
SMILES CC1Cc2ccccc2N1C(=O)CSc1nnc(o1)-c1ccc(cc1)S(=O)(=O)N1CCCC1
InChI Key InChIKey=BOLBJHLJTKLMGX-UHFFFAOYSA-N
Data  1 EC50
  Tab Delimited (TSV)   2D SDfile   Computed 3D by Vconf -m prep SDfile
Find this compound or compounds like it in BindingDB:
Activity Spreadsheet -- Enzyme Inhibition Constant Data from BindingDB
Found 1 hit for monomerid = 40482
TargetEstrogen receptor(Homo sapiens (Human))
Emory University
Curated by PubChem BioAssay
LigandPNGBDBM40482(1-(2-Methyl-2,3-dihydro-indol-1-yl)-2-{5-[4-(pyrro...)
Affinity DataEC50:  7.79E+3nM. Assay description: NIH Molecular Libraries Screening Centers Network [MLSCN] Emory Chemical Biology Discovery Center in MLSCN Assay provider: John A. Katzenellenbogen, ...
In DepthDetails PCBioAssay