BDBM40508 MLS000047251::N-[4-(5-thien-2-yl-1,2,4-oxadiazol-3-yl)phenyl]nicotinamide::N-[4-(5-thiophen-2-yl-1,2,4-oxadiazol-3-yl)phenyl]-3-pyridinecarboxamide::N-[4-(5-thiophen-2-yl-1,2,4-oxadiazol-3-yl)phenyl]pyridine-3-carboxamide::N-[4-[5-(2-thienyl)-1,2,4-oxadiazol-3-yl]phenyl]nicotinamide::SMR000033262::cid_3240032
SMILES O=C(Nc1ccc(cc1)-c1noc(n1)-c1cccs1)c1cccnc1
InChI Key InChIKey=HMZVTBHSSAEYDI-UHFFFAOYSA-N
Data  3 IC50  1 EC50
  Tab Delimited (TSV)   2D SDfile   Computed 3D by Vconf -m prep SDfile
Find this compound or compounds like it in BindingDB:
Activity Spreadsheet -- Enzyme Inhibition Constant Data from BindingDB
Found 4 hits for monomerid = 40508
TargetEstrogen receptor(Homo sapiens (Human))
Emory University
Curated by PubChem BioAssay
LigandPNGBDBM40508(MLS000047251 | N-[4-(5-thien-2-yl-1,2,4-oxadiazol-...)
Affinity DataEC50:  1.00E+7nM. Assay description: NIH Molecular Libraries Screening Centers Network [MLSCN] Emory Chemical Biology Discovery Center in MLSCN Assay provider: John A. Katzenellenbogen, ...
In DepthDetails PCBioAssay
TargetCaspase-3(Homo sapiens (Human))
Burnham Center For Chemical Genomics
Curated by PubChem BioAssay
LigandPNGBDBM40508(MLS000047251 | N-[4-(5-thien-2-yl-1,2,4-oxadiazol-...)
Affinity DataIC50:  5.48E+4nM. Assay description: Data Source: Sanford-Burnham Center for Chemical Genomics (SBCCG) Source Affiliation: Sanford-Burnham Medical Research Institute (SBMRI, San Diego, C...
In DepthDetails PCBioAssay
TargetSentrin-specific protease 6(Homo sapiens (Human))
Burnham Center For Chemical Genomics
Curated by PubChem BioAssay
LigandPNGBDBM40508(MLS000047251 | N-[4-(5-thien-2-yl-1,2,4-oxadiazol-...)
Affinity DataIC50:  7.62E+4nM. Assay description: Data Source: Sanford-Burnham Center for Chemical Genomics (SBCCG) Source Affiliation: Sanford-Burnham Medical Research Institute (SBMRI, San Diego, C...
In DepthDetails PCBioAssay
TargetSentrin-specific protease 8(Homo sapiens (Human))
Burnham Center For Chemical Genomics
Curated by PubChem BioAssay
LigandPNGBDBM40508(MLS000047251 | N-[4-(5-thien-2-yl-1,2,4-oxadiazol-...)
Affinity DataIC50: >1.00E+5nM. Assay description: Data Source: Sanford-Burnham Center for Chemical Genomics (SBCCG) Source Affiliation: Sanford-Burnham Medical Research Institute (SBMRI, San Diego, C...
In DepthDetails PCBioAssay