BDBM40515 6-amino-4-(2-ethoxyphenyl)-3-phenyl-2,4-dihydro-[1,2]oxazolo[5,4-b]pyridine-5-carbonitrile::6-amino-4-(2-ethoxyphenyl)-3-phenyl-2,4-dihydroisoxazolo[5,4-b]pyridine-5-carbonitrile::6-amino-4-(2-ethoxyphenyl)-3-phenyl-4,7-dihydroisoxazolo[5,4-b]pyridine-5-carbonitrile::6-amino-4-o-phenetyl-3-phenyl-2,4-dihydroisoxazolo[5,4-b]pyridine-5-carbonitrile::6-azanyl-4-(2-ethoxyphenyl)-3-phenyl-2,4-dihydro-[1,2]oxazolo[5,4-b]pyridine-5-carbonitrile::MLS000043378::SMR000020195::cid_5771468
SMILES CCOc1ccccc1C1C(C#N)C(N)=Nc2onc(c12)-c1ccccc1
InChI Key InChIKey=GDJKGAANWXYGGG-UHFFFAOYSA-N
Data  1 IC50  3 EC50
  Tab Delimited (TSV)   2D SDfile   Computed 3D by Vconf -m prep SDfile
Find this compound or compounds like it in BindingDB:
Activity Spreadsheet -- Enzyme Inhibition Constant Data from BindingDB
Found 4 hits for monomerid = 40515
TargetEstrogen receptor(Homo sapiens (Human))
Emory University
Curated by PubChem BioAssay
LigandPNGBDBM40515(6-amino-4-(2-ethoxyphenyl)-3-phenyl-2,4-dihydro-[1...)
Affinity DataEC50:  1.75E+4nM. Assay description: NIH Molecular Libraries Screening Centers Network [MLSCN] Emory Chemical Biology Discovery Center in MLSCN Assay provider: John A. Katzenellenbogen, ...
Ligand InfoPC cidPC sid
In DepthDetails PCBioAssay
TargetProtein RecA(Mycobacterium tuberculosis H37Rv)
Broad Institute
Curated by PubChem BioAssay
LigandPNGBDBM40515(6-amino-4-(2-ethoxyphenyl)-3-phenyl-2,4-dihydro-[1...)
Affinity DataEC50:  1.39E+3nM. Assay description: Keywords: GFP-RecA intein, protein splicing, refolding, reducing reagent, GFP fluorescence Assay Overview: M. tuberculosis harbors three inteins, whi...
Ligand InfoPC cidPC sid
In DepthDetails PCBioAssay
TargetProtein RecA(Mycobacterium tuberculosis H37Rv)
Broad Institute
Curated by PubChem BioAssay
LigandPNGBDBM40515(6-amino-4-(2-ethoxyphenyl)-3-phenyl-2,4-dihydro-[1...)
Affinity DataEC50:  1.62E+4nM. Assay description: Keywords: GFP, refolding, reducing reagent, GFP fluorescence Assay Overview: M. tuberculosis harbors three inteins, which interrupt the DnaB, RecA, a...
Ligand InfoPC cidPC sid
In DepthDetails PCBioAssay
TargetM17 leucyl aminopeptidase(Plasmodium falciparum 3D7)
Srmlsc
Curated by PubChem BioAssay
LigandPNGBDBM40515(6-amino-4-(2-ethoxyphenyl)-3-phenyl-2,4-dihydro-[1...)
Affinity DataIC50:  5.27E+4nM. Assay description: Southern Research Molecular Libraries Screening Center (SRMLSC) Southern Research Institute (Birmingham, Alabama) NIH Molecular Libraries Screening...
Ligand InfoPC cidPC sid
In DepthDetails PCBioAssay