BDBM40521 MLS000051543::N-(4,5-diphenyl-1,3-oxazol-2-yl)-2-(1-methyltetrazol-5-yl)sulfanylacetamide::N-(4,5-diphenyl-1,3-oxazol-2-yl)-2-[(1-methyl-1,2,3,4-tetrazol-5-yl)sulfanyl]ethanamide::N-(4,5-diphenyl-1,3-oxazol-2-yl)-2-[(1-methyl-1H-tetrazol-5-yl)thio]acetamide::N-(4,5-diphenyl-2-oxazolyl)-2-[(1-methyl-5-tetrazolyl)thio]acetamide::N-(4,5-diphenyloxazol-2-yl)-2-[(1-methyltetrazol-5-yl)thio]acetamide::SMR000079980::cid_1969317
SMILES Cn1nnnc1SCC(=O)Nc1nc(c(o1)-c1ccccc1)-c1ccccc1
InChI Key InChIKey=DMFWXHHFEQTDEK-UHFFFAOYSA-N
Data  2 EC50
  Tab Delimited (TSV)   2D SDfile   Computed 3D by Vconf -m prep SDfile
Find this compound or compounds like it in BindingDB:
Activity Spreadsheet -- Enzyme Inhibition Constant Data from BindingDB
Found 2 hits for monomerid = 40521
TargetStreptokinase A(Streptococcus pyogenes M1 GAS)
Broad Institute
Curated by PubChem BioAssay
LigandPNGBDBM40521(MLS000051543 | N-(4,5-diphenyl-1,3-oxazol-2-yl)-2-...)
Affinity DataEC50:  1.50E+5nM. Assay description: Keywords: Group A streptococcus, GAS, streptokinase, expression, virulence, inhibition, dose response, EC50 Assay Overview: The goal of this assa...
In DepthDetails PCBioAssay
TargetEstrogen receptor(Homo sapiens (Human))
Emory University
Curated by PubChem BioAssay
LigandPNGBDBM40521(MLS000051543 | N-(4,5-diphenyl-1,3-oxazol-2-yl)-2-...)
Affinity DataEC50:  2.22E+4nM. Assay description: NIH Molecular Libraries Screening Centers Network [MLSCN] Emory Chemical Biology Discovery Center in MLSCN Assay provider: John A. Katzenellenbogen, ...
In DepthDetails PCBioAssay