BDBM40534 1,5-dimethyl-4-oxidanylidene-N-(3,4,5-trimethoxyphenyl)pyrrolo[3,2-c]quinoline-2-carboxamide::1,5-dimethyl-4-oxo-N-(3,4,5-trimethoxyphenyl)-2-pyrrolo[3,2-c]quinolinecarboxamide::1,5-dimethyl-4-oxo-N-(3,4,5-trimethoxyphenyl)pyrrolo[3,2-c]quinoline-2-carboxamide::4-keto-1,5-dimethyl-N-(3,4,5-trimethoxyphenyl)pyrrolo[3,2-c]quinoline-2-carboxamide::MLS000118077::SMR000095025::cid_5309406
SMILES COc1cc(NC(=O)c2cc3c(n2C)c2ccccc2n(C)c3=O)cc(OC)c1OC
InChI Key InChIKey=GKMUNQBSDDBDID-UHFFFAOYSA-N
Data  1 EC50
  Tab Delimited (TSV)   2D SDfile   Computed 3D by Vconf -m prep SDfile
Find this compound or compounds like it in BindingDB:
Activity Spreadsheet -- Enzyme Inhibition Constant Data from BindingDB
Found 1 hit for monomerid = 40534
TargetEstrogen receptor(Homo sapiens (Human))
Emory University
Curated by PubChem BioAssay
LigandPNGBDBM40534(1,5-dimethyl-4-oxidanylidene-N-(3,4,5-trimethoxyph...)
Affinity DataEC50:  1.29E+4nM. Assay description: NIH Molecular Libraries Screening Centers Network [MLSCN] Emory Chemical Biology Discovery Center in MLSCN Assay provider: John A. Katzenellenbogen, ...
In DepthDetails PCBioAssay