BDBM40538 6-(ethylthio)-1-(4-methylphenyl)-2H-pyrazolo[3,4-d]pyrimidin-4-one::6-(ethylthio)-1-(p-tolyl)-2H-pyrazolo[3,4-d]pyrimidin-4-one::6-ethylsulfanyl-1-(4-methylphenyl)-2H-pyrazolo[3,4-d]pyrimidin-4-one::MLS000101100::SMR000016346::cid_866965
SMILES CCSc1nc2n(ncc2c(=O)[nH]1)-c1ccc(C)cc1
InChI Key InChIKey=GYAGKDGTFSEQKU-UHFFFAOYSA-N
Data  1 EC50
  Tab Delimited (TSV)   2D SDfile   Computed 3D by Vconf -m prep SDfile
Find this compound or compounds like it in BindingDB:
Activity Spreadsheet -- Enzyme Inhibition Constant Data from BindingDB
Found 1 hit for monomerid = 40538
TargetEstrogen receptor(Homo sapiens (Human))
Emory University
Curated by PubChem BioAssay
LigandPNGBDBM40538(6-(ethylthio)-1-(4-methylphenyl)-2H-pyrazolo[3,4-d...)
Affinity DataEC50:  1.44E+4nM. Assay description: NIH Molecular Libraries Screening Centers Network [MLSCN] Emory Chemical Biology Discovery Center in MLSCN Assay provider: John A. Katzenellenbogen, ...
In DepthDetails PCBioAssay