BDBM40543 (2-mesyl-4-tosyl-thiazol-5-yl)-(tetrahydrofurfuryl)amine::4-(4-methylphenyl)sulfonyl-2-methylsulfonyl-N-(2-oxolanylmethyl)-5-thiazolamine::4-(4-methylphenyl)sulfonyl-2-methylsulfonyl-N-(oxolan-2-ylmethyl)-1,3-thiazol-5-amine::MLS000113988::SMR000109878::cid_2934240
SMILES Cc1ccc(cc1)S(=O)(=O)c1nc(sc1NCC1CCCO1)S(C)(=O)=O
InChI Key InChIKey=ULAMVKUESIDBQN-UHFFFAOYSA-N
Data  1 EC50
  Tab Delimited (TSV)   2D SDfile   Computed 3D by Vconf -m prep SDfile
Find this compound or compounds like it in BindingDB:
Activity Spreadsheet -- Enzyme Inhibition Constant Data from BindingDB
Found 1 hit for monomerid = 40543
TargetEstrogen receptor(Homo sapiens (Human))
Emory University
Curated by PubChem BioAssay
LigandPNGBDBM40543((2-mesyl-4-tosyl-thiazol-5-yl)-(tetrahydrofurfuryl...)
Affinity DataEC50:  1.00E+7nM. Assay description: NIH Molecular Libraries Screening Centers Network [MLSCN] Emory Chemical Biology Discovery Center in MLSCN Assay provider: John A. Katzenellenbogen, ...
In DepthDetails PCBioAssay