BDBM40545 2-ethoxy-2H-quinoline-1-carboxylic acid ethyl ester::EEDQ::MLS000069601::SMR000059033::cid_27833::ethyl 2-ethoxy-2H-quinoline-1-carboxylate
SMILES CCOC1C=Cc2ccccc2N1C(=O)OCC
InChI Key InChIKey=GKQLYSROISKDLL-UHFFFAOYSA-N
Data  1 EC50
  Tab Delimited (TSV)   2D SDfile   Computed 3D by Vconf -m prep SDfile
Find this compound or compounds like it in BindingDB:
Activity Spreadsheet -- Enzyme Inhibition Constant Data from BindingDB
Found 1 hit for monomerid = 40545
TargetEstrogen receptor(Homo sapiens (Human))
Emory University
Curated by PubChem BioAssay
LigandPNGBDBM40545(2-ethoxy-2H-quinoline-1-carboxylic acid ethyl este...)
Affinity DataEC50:  1.00E+7nM. Assay description: NIH Molecular Libraries Screening Centers Network [MLSCN] Emory Chemical Biology Discovery Center in MLSCN Assay provider: John A. Katzenellenbogen, ...
In DepthDetails PCBioAssay