BDBM40550 MLS000121662::N-(4-Acetyl-phenyl)-2-[1-(3-methoxy-phenyl)-1H-tetrazol-5-ylsulfanyl]-acetamide::N-(4-acetylphenyl)-2-[1-(3-methoxyphenyl)tetrazol-5-yl]sulfanylacetamide::N-(4-acetylphenyl)-2-[[1-(3-methoxyphenyl)-5-tetrazolyl]thio]acetamide::N-(4-acetylphenyl)-2-[[1-(3-methoxyphenyl)tetrazol-5-yl]thio]acetamide::N-(4-ethanoylphenyl)-2-[[1-(3-methoxyphenyl)-1,2,3,4-tetrazol-5-yl]sulfanyl]ethanamide::SMR000119030::cid_1075016
SMILES COc1cccc(c1)-n1nnnc1SCC(=O)Nc1ccc(cc1)C(C)=O
InChI Key InChIKey=GJPVGSWKHKLPKQ-UHFFFAOYSA-N
Data  1 EC50
  Tab Delimited (TSV)   2D SDfile   Computed 3D by Vconf -m prep SDfile
Find this compound or compounds like it in BindingDB:
Activity Spreadsheet -- Enzyme Inhibition Constant Data from BindingDB
Found 1 hit for monomerid = 40550
TargetEstrogen receptor(Homo sapiens (Human))
Emory University
Curated by PubChem BioAssay
LigandPNGBDBM40550(MLS000121662 | N-(4-Acetyl-phenyl)-2-[1-(3-methoxy...)
Affinity DataEC50:  1.73E+4nM. Assay description: NIH Molecular Libraries Screening Centers Network [MLSCN] Emory Chemical Biology Discovery Center in MLSCN Assay provider: John A. Katzenellenbogen, ...
In DepthDetails PCBioAssay