BDBM40558 4-(4-Methoxy-phenyl)-2-methyl-5-oxo-5H-indeno[1,2-b]pyridine-3-carbonitrile::4-(4-methoxyphenyl)-2-methyl-5-oxidanylidene-indeno[1,2-b]pyridine-3-carbonitrile::4-(4-methoxyphenyl)-2-methyl-5-oxo-3-indeno[1,2-b]pyridinecarbonitrile::4-(4-methoxyphenyl)-2-methyl-5-oxoindeno[1,2-b]pyridine-3-carbonitrile::5-keto-4-(4-methoxyphenyl)-2-methyl-indeno[1,2-b]pyridine-3-carbonitrile::MLS000554940::SMR000147057::cid_947086
SMILES COc1ccc(cc1)-c1c2C(=O)c3ccccc3-c2nc(C)c1C#N
InChI Key InChIKey=UMIONWWTGWTKKI-UHFFFAOYSA-N
Data  4 EC50
  Tab Delimited (TSV)   2D SDfile   Computed 3D by Vconf -m prep SDfile
Find this compound or compounds like it in BindingDB:
Activity Spreadsheet -- Enzyme Inhibition Constant Data from BindingDB
Found 4 hits for monomerid = 40558
TargetEstrogen receptor(Homo sapiens (Human))
Emory University
Curated by PubChem BioAssay
LigandPNGBDBM40558(4-(4-Methoxy-phenyl)-2-methyl-5-oxo-5H-indeno[1,2-...)
Affinity DataEC50:  1.00E+7nM. Assay description: NIH Molecular Libraries Screening Centers Network [MLSCN] Emory Chemical Biology Discovery Center in MLSCN Assay provider: John A. Katzenellenbogen, ...
In DepthDetails PCBioAssay
TargetNuclear receptor coactivator 2(Homo sapiens (Human))
The Scripps Research Institute Molecular Screening Center
Curated by PubChem BioAssay
LigandPNGBDBM40558(4-(4-Methoxy-phenyl)-2-methyl-5-oxo-5H-indeno[1,2-...)
Affinity DataEC50:  3.26E+4nM. Assay description: Source (MLSCN Center Name): The Scripps Research Institute Molecular Screening Center Center Affiliation: The Scripps Research Institute (TSRI) Assay...
In DepthDetails PCBioAssay
TargetNuclear receptor coactivator 3(Homo sapiens (Human))
The Scripps Research Institute Molecular Screening Center
Curated by PubChem BioAssay
LigandPNGBDBM40558(4-(4-Methoxy-phenyl)-2-methyl-5-oxo-5H-indeno[1,2-...)
Affinity DataEC50:  4.83E+4nM. Assay description: Source (MLSCN Center Name): The Scripps Research Institute Molecular Screening Center http://molscreen.florida.scripps.edu/ Center Affiliation: The ...
In DepthDetails PCBioAssay
TargetNuclear receptor coactivator 1(Homo sapiens (Human))
The Scripps Research Institute Molecular Screening Center
Curated by PubChem BioAssay
LigandPNGBDBM40558(4-(4-Methoxy-phenyl)-2-methyl-5-oxo-5H-indeno[1,2-...)
Affinity DataEC50:  5.53E+4nM. Assay description: Source (MLSCN Center Name): The Scripps Research Institute Molecular Screening Center Center Affiliation: The Scripps Research Institute (TSRI) Assay...
In DepthDetails PCBioAssay