BDBM40681 4-methoxy-N-(4-pyrrolidin-1-ylphenyl)benzamide::4-methoxy-N-(4-pyrrolidinophenyl)benzamide::4-methoxy-N-[4-(1-pyrrolidinyl)phenyl]benzamide::MLS000534377::SMR000141809::cid_960708
SMILES COc1ccc(cc1)C(=O)Nc1ccc(cc1)N1CCCC1
InChI Key InChIKey=RMMDQOQXWCCGDH-UHFFFAOYSA-N
Data  3 IC50
  Tab Delimited (TSV)   2D SDfile   Computed 3D by Vconf -m prep SDfile
Find this compound or compounds like it in BindingDB:
Activity Spreadsheet -- Enzyme Inhibition Constant Data from BindingDB
Found 3 hits for monomerid = 40681
TargetNuclear receptor subfamily 4 group A member 1(Homo sapiens (Human))
Burnham Center For Chemical Genomics
Curated by PubChem BioAssay
LigandPNGBDBM40681(4-methoxy-N-(4-pyrrolidin-1-ylphenyl)benzamide | 4...)
Affinity DataIC50:  4.19E+4nM. Assay description: Sanford-Burnham Center for Chemical Genomics (SBCCG) Sanford-Burnham Medical Research Institute (San Diego, CA) NIH Molecular Libraries Screening Cen...
In DepthDetails PCBioAssay
TargetProtein artemis(Homo sapiens (Human))
Burnham Center For Chemical Genomics
Curated by PubChem BioAssay
LigandPNGBDBM40681(4-methoxy-N-(4-pyrrolidin-1-ylphenyl)benzamide | 4...)
Affinity DataIC50:  1.62E+4nM. Assay description: Data Source: Sanford-Burnham Center for Chemical Genomics (SBCCG) Source Affiliation: Sanford-Burnham Medical Research Institute (SBMRI, San Diego CA...
In DepthDetails PCBioAssay
TargetInduced myeloid leukemia cell differentiation protein Mcl-1(Homo sapiens (Human))
Emory University
Curated by PubChem BioAssay
LigandPNGBDBM40681(4-methoxy-N-(4-pyrrolidin-1-ylphenyl)benzamide | 4...)
Affinity DataIC50:  3.44E+3nM. Assay description: NIH Molecular Libraries Screening Centers Network [MLSCN] Emory Chemical Biology Discovery Center in MLSCN Assay provider: Nikolovska-Coleska, Univer...
In DepthDetails PCBioAssay