BDBM40693 5,6-dihydro-4H-cyclopenta[b]thiophen-2-yl-(4-phenyl-1-piperazinyl)methanone::5,6-dihydro-4H-cyclopenta[b]thiophen-2-yl-(4-phenylpiperazin-1-yl)methanone::5,6-dihydro-4H-cyclopenta[b]thiophen-2-yl-(4-phenylpiperazino)methanone::MLS000566353::SMR000153528::cid_2472264
SMILES O=C(N1CCN(CC1)c1ccccc1)c1cc2CCCc2s1
InChI Key InChIKey=HORPGCYDIQJZNG-UHFFFAOYSA-N
Data  4 IC50
  Tab Delimited (TSV)   2D SDfile   Computed 3D by Vconf -m prep SDfile
Find this compound or compounds like it in BindingDB:
Activity Spreadsheet -- Enzyme Inhibition Constant Data from BindingDB
Found 4 hits for monomerid = 40693
TargetNuclear receptor subfamily 4 group A member 1(Homo sapiens (Human))
Burnham Center For Chemical Genomics
Curated by PubChem BioAssay
LigandPNGBDBM40693(5,6-dihydro-4H-cyclopenta[b]thiophen-2-yl-(4-pheny...)
Affinity DataIC50:  3.63E+4nM. Assay description: Sanford-Burnham Center for Chemical Genomics (SBCCG) Sanford-Burnham Medical Research Institute (San Diego, CA) NIH Molecular Libraries Screening Cen...
In DepthDetails PCBioAssay
TargetCarboxy-terminal domain RNA polymerase II polypeptide A small phosphatase 1(Homo sapiens (Human))
Burnham Center For Chemical Genomics
Curated by PubChem BioAssay
LigandPNGBDBM40693(5,6-dihydro-4H-cyclopenta[b]thiophen-2-yl-(4-pheny...)
Affinity DataIC50:  2.24E+4nM. Assay description: Data Source: Sanford-Burnham Center for Chemical Genomics (SBCCG) Source Affiliation: Sanford-Burnham Medical Research Institute (SBMRI, San Diego, C...
In DepthDetails PCBioAssay
TargetEstrogen receptor beta(Homo sapiens (Human))
Emory University
Curated by PubChem BioAssay
LigandPNGBDBM40693(5,6-dihydro-4H-cyclopenta[b]thiophen-2-yl-(4-pheny...)
Affinity DataIC50:  3.87E+3nM. Assay description: NIH Molecular Libraries Screening Centers Network [MLSCN] Emory Chemical Biology Discovery Center in MLSCN Assay provider: John A. Katzenellenbogen, ...
In DepthDetails PCBioAssay
TargetEstrogen receptor beta(Homo sapiens (Human))
Emory University
Curated by PubChem BioAssay
LigandPNGBDBM40693(5,6-dihydro-4H-cyclopenta[b]thiophen-2-yl-(4-pheny...)
Affinity DataIC50:  5.00E+4nM. Assay description: NIH Molecular Libraries Screening Centers Network [MLSCN] Emory Chemical Biology Discovery Center in MLSCN Assay provider: John A. Katzenellenbogen, ...
In DepthDetails PCBioAssay