BDBM40714 2-(2-furanyl)-4-quinolinecarboxylic acid [2-[(2-methoxyphenyl)methylamino]-2-oxoethyl] ester::2-(2-furyl)cinchoninic acid [2-keto-2-(o-anisylamino)ethyl] ester::MLS000565742::SMR000152918::[2-[(2-methoxyphenyl)methylamino]-2-oxidanylidene-ethyl] 2-(furan-2-yl)quinoline-4-carboxylate::[2-[(2-methoxyphenyl)methylamino]-2-oxoethyl] 2-(furan-2-yl)quinoline-4-carboxylate::cid_2092254
SMILES COc1ccccc1CNC(=O)COC(=O)c1cc(nc2ccccc12)-c1ccco1
InChI Key InChIKey=LHUVKNSYJXRVJA-UHFFFAOYSA-N
Data  10 IC50
  Tab Delimited (TSV)   2D SDfile   Computed 3D by Vconf -m prep SDfile
Find this compound or compounds like it in BindingDB:
Activity Spreadsheet -- Enzyme Inhibition Constant Data from BindingDB
Found 10 hits for monomerid = 40714
TargetFocal adhesion kinase 1(Homo sapiens (Human))
The Scripps Research Institute Molecular Screening Center
Curated by PubChem BioAssay
LigandPNGBDBM40714(2-(2-furanyl)-4-quinolinecarboxylic acid [2-[(2-me...)
Affinity DataIC50:  1.48E+4nM. Assay description: Source (MLSCN Center Name): The Scripps Research Institute Molecular Screening Center Center Affiliation: The Scripps Research Institute, TSRI Assa...
In DepthDetails PCBioAssay
TargetNuclear receptor subfamily 4 group A member 1(Homo sapiens (Human))
Burnham Center For Chemical Genomics
Curated by PubChem BioAssay
LigandPNGBDBM40714(2-(2-furanyl)-4-quinolinecarboxylic acid [2-[(2-me...)
Affinity DataIC50:  1.07E+4nM. Assay description: Sanford-Burnham Center for Chemical Genomics (SBCCG) Sanford-Burnham Medical Research Institute (San Diego, CA) NIH Molecular Libraries Screening Cen...
In DepthDetails PCBioAssay
TargetInduced myeloid leukemia cell differentiation protein Mcl-1(Homo sapiens (Human))
Emory University
Curated by PubChem BioAssay
LigandPNGBDBM40714(2-(2-furanyl)-4-quinolinecarboxylic acid [2-[(2-me...)
Affinity DataIC50:  2.04E+3nM. Assay description: NIH Molecular Libraries Screening Centers Network [MLSCN] Emory Chemical Biology Discovery Center in MLSCN Assay provider: Nikolovska-Coleska, Univer...
In DepthDetails PCBioAssay
TargetProtein-tyrosine kinase 2-beta(Homo sapiens (Human))
The Scripps Research Institute Molecular Screening Center
Curated by PubChem BioAssay
LigandPNGBDBM40714(2-(2-furanyl)-4-quinolinecarboxylic acid [2-[(2-me...)
Affinity DataIC50:  5.79E+3nM. Assay description: Source (MLPCN Center Name): The Scripps Research Institute Molecular Screening Center (SRIMSC) Affiliation: The Scripps Research Institute, TSRI Assa...
In DepthDetails PCBioAssay
TargetDNA (cytosine-5)-methyltransferase 1(Homo sapiens (Human))
Burnham Center For Chemical Genomics
Curated by PubChem BioAssay
LigandPNGBDBM40714(2-(2-furanyl)-4-quinolinecarboxylic acid [2-[(2-me...)
Affinity DataIC50:  7.11E+3nM. Assay description: Data Source: Sanford-Burnham Center for Chemical Genomics (SBCCG) Source Affiliation: Sanford-Burnham Medical Research Institute (SBMRI, San Diego, C...
In DepthDetails PCBioAssay
TargetCore protein(Hepatitis C virus)
The Scripps Research Institute Molecular Screening Center
Curated by PubChem BioAssay
LigandPNGBDBM40714(2-(2-furanyl)-4-quinolinecarboxylic acid [2-[(2-me...)
Affinity DataIC50: >4.98E+4nM. Assay description: Source (MLPCN Center Name): The Scripps Research Institute Molecular Screening Center Affiliation: The Scripps Research Institute, TSRI Assay Provide...
In DepthDetails PCBioAssay
TargetSUMO-activating enzyme subunit 1(Homo sapiens (Human))
Burnham Center For Chemical Genomics
Curated by PubChem BioAssay
LigandPNGBDBM40714(2-(2-furanyl)-4-quinolinecarboxylic acid [2-[(2-me...)
Affinity DataIC50:  1.06E+4nM. Assay description: Data Source: Sanford-Burnham Center for Chemical Genomics (SBCCG) Source Affiliation: Sanford-Burnham Medical Research Institute (SBMRI, San Diego, C...
In DepthDetails PCBioAssay
TargetAmyloid-beta A4 precursor protein-binding family A member 1(Rattus norvegicus)
Burnham Center For Chemical Genomics
Curated by PubChem BioAssay
LigandPNGBDBM40714(2-(2-furanyl)-4-quinolinecarboxylic acid [2-[(2-me...)
Affinity DataIC50:  2.27E+4nM. Assay description: Data Source: Sanford-Burnham Center for Chemical Genomics (SBCCG) Source Affiliation: Sanford-Burnham Medical Research Institute (SBMRI, San Diego, C...
In DepthDetails PCBioAssay
TargetAmyloid-beta A4 precursor protein-binding family A member 1(Rattus norvegicus)
Burnham Center For Chemical Genomics
Curated by PubChem BioAssay
LigandPNGBDBM40714(2-(2-furanyl)-4-quinolinecarboxylic acid [2-[(2-me...)
Affinity DataIC50:  7.83E+3nM. Assay description: Data Source: Sanford-Burnham Center for Chemical Genomics (SBCCG) Source Affiliation: Sanford-Burnham Medical Research Institute (SBMRI, San Diego, C...
In DepthDetails PCBioAssay
TargetSUMO-conjugating enzyme UBC9(Homo sapiens (Human))
Burnham Center For Chemical Genomics
Curated by PubChem BioAssay
LigandPNGBDBM40714(2-(2-furanyl)-4-quinolinecarboxylic acid [2-[(2-me...)
Affinity DataIC50:  5.42E+3nM. Assay description: Data Source: Sanford-Burnham Center for Chemical Genomics (SBCCG) Source Affiliation: Sanford-Burnham Medical Research Institute (SBMRI, San Diego, C...
In DepthDetails PCBioAssay