BDBM40741 8-amino-6-quinolinol::8-aminoquinolin-6-ol::8-azanylquinolin-6-ol::cid_244284
SMILES Nc1cc(O)cc2cccnc12
InChI Key InChIKey=XSAFKWKVRFZBMP-UHFFFAOYSA-N
Data  1 IC50
  Tab Delimited (TSV)   2D SDfile   Computed 3D by Vconf -m prep SDfile
Find this compound or compounds like it in BindingDB:
Activity Spreadsheet -- Enzyme Inhibition Constant Data from BindingDB
Found 1 hit for monomerid = 40741
TargetHeat shock protein HSP 90-alpha(Homo sapiens (Human))
Emory University
Curated by PubChem BioAssay
LigandPNGBDBM40741(8-amino-6-quinolinol | 8-aminoquinolin-6-ol | 8-az...)
Affinity DataIC50: <625nM. Assay description: Emory Chemistry-Biology Discovery Center Assay Overview: MLSCN Grant: 1 X01MH78953-01 Hsp90 is a chaperon with important roles in maintaining transfo...
In DepthDetails PCBioAssay