BDBM40757 (4-fluoro-1,3-benzothiazol-2-yl)-[5-(3-methoxyphenyl)-1,3,4-oxadiazol-2-yl]amine::MLS000045465::N-(4-fluoranyl-1,3-benzothiazol-2-yl)-5-(3-methoxyphenyl)-1,3,4-oxadiazol-2-amine::N-(4-fluoro-1,3-benzothiazol-2-yl)-5-(3-methoxyphenyl)-1,3,4-oxadiazol-2-amine::SMR000016520::cid_3242011
SMILES COc1cccc(c1)-c1nnc(Nc2nc3c(F)cccc3s2)o1
InChI Key InChIKey=YZNJDEFKEOAFGO-UHFFFAOYSA-N
Data  1 IC50
  Tab Delimited (TSV)   2D SDfile   Computed 3D by Vconf -m prep SDfile
Find this compound or compounds like it in BindingDB:
Activity Spreadsheet -- Enzyme Inhibition Constant Data from BindingDB
Found 1 hit for monomerid = 40757
TargetCollagenase 3(Homo sapiens (Human))
The Scripps Research Institute Molecular Screening Center
Curated by PubChem BioAssay
LigandPNGBDBM40757((4-fluoro-1,3-benzothiazol-2-yl)-[5-(3-methoxyphen...)
Affinity DataIC50: >3.98E+4nM. Assay description: External Assay ID: MMP13_INH_deltaRFU_ 1536_IC50 Source (MLSCN Center Name): The Scripps Research Institute Molecular Screening Center Center Affilia...
In DepthDetails PCBioAssay