BDBM408072 US10336774, Example 57
SMILES N[C@@H]1C[C@@H](O)CC11CCN(CC1)c1cnc(Sc2ccnc(Cl)c2Cl)c(N)n1
InChI Key InChIKey=VCACXGULTWUFOL-ZYHUDNBSSA-N
Data  1 IC50
  Tab Delimited (TSV)   2D SDfile   Computed 3D by Vconf -m prep SDfile
Find this compound or compounds like it in BindingDB:
Activity Spreadsheet -- Enzyme Inhibition Constant Data from BindingDB
Found 1 hit for monomerid = 408072
TargetTyrosine-protein phosphatase non-receptor type 11(Homo sapiens (Human))
Novartis
US Patent
LigandPNGBDBM408072(US10336774, Example 57)
Affinity DataIC50:  3nM. Assay description: SHP2 is allosterically activated through binding of bis-tyrosyl-phorphorylated peptides to its Src Homology 2 (SH2) domains. The latter activation st...
In DepthDetails US Patent