BDBM40828 3-(1-azepanylsulfonyl)-N-(4-thiophen-2-yl-2-thiazolyl)benzamide::3-(azepan-1-ylsulfonyl)-N-(4-thiophen-2-yl-1,3-thiazol-2-yl)benzamide::3-(azepan-1-ylsulfonyl)-N-[4-(2-thienyl)thiazol-2-yl]benzamide::MLS000036031::SMR000062677::cid_2419979
SMILES O=C(Nc1nc(cs1)-c1cccs1)c1cccc(c1)S(=O)(=O)N1CCCCCC1
InChI Key InChIKey=YXWFPBWAZYOZHU-UHFFFAOYSA-N
Data  3 IC50
  Tab Delimited (TSV)   2D SDfile   Computed 3D by Vconf -m prep SDfile
Find this compound or compounds like it in BindingDB:
Activity Spreadsheet -- Enzyme Inhibition Constant Data from BindingDB
Found 3 hits for monomerid = 40828
TargetComplement C1s subcomponent(Homo sapiens (Human))
Pcmd
Curated by PubChem BioAssay
LigandPNGBDBM40828(3-(1-azepanylsulfonyl)-N-(4-thiophen-2-yl-2-thiazo...)
Affinity DataIC50: >5.00E+4nM. Assay description: Molecular Library Screening Center Network (MLSCN) Penn Center for Molecular Discovery (PCMD) Assay Provider: Dr. Scott L. Diamond, University of Pen...
In DepthDetails PCBioAssay
TargetProtein Wnt-3a(Mus musculus)
Burnham Center For Chemical Genomics
Curated by PubChem BioAssay
LigandPNGBDBM40828(3-(1-azepanylsulfonyl)-N-(4-thiophen-2-yl-2-thiazo...)
Affinity DataIC50:  1.92E+4nM
In DepthDetails PCBioAssay
TargetZinc finger protein GLI1(Mus musculus)
Burnham Center For Chemical Genomics
Curated by PubChem BioAssay
LigandPNGBDBM40828(3-(1-azepanylsulfonyl)-N-(4-thiophen-2-yl-2-thiazo...)
Affinity DataIC50:  2.28E+3nM. Assay description: Data Source: Sanford-Burnham Center for Chemical Genomics (SBCCG) Source Affiliation: Sanford-Burnham Medical Research Institute (SBMRI, San Diego, C...
In DepthDetails PCBioAssay