BDBM40861 1-(2-chlorophenyl)-5-[4-(4-ethyl-1-piperazinyl)phenyl]-6-methyl-4-pyrazolo[3,4-d]pyrimidinone::1-(2-chlorophenyl)-5-[4-(4-ethylpiperazin-1-yl)phenyl]-6-methyl-1,5-dihydro-4H-pyrazolo[3,4-d]pyrimidin-4-one::1-(2-chlorophenyl)-5-[4-(4-ethylpiperazin-1-yl)phenyl]-6-methyl-pyrazolo[3,4-d]pyrimidin-4-one::1-(2-chlorophenyl)-5-[4-(4-ethylpiperazin-1-yl)phenyl]-6-methylpyrazolo[3,4-d]pyrimidin-4-one::1-(2-chlorophenyl)-5-[4-(4-ethylpiperazino)phenyl]-6-methyl-pyrazolo[3,4-d]pyrimidin-4-one::MLS000091936::SMR000026460::cid_3245389
SMILES CCN1CCN(CC1)c1ccc(cc1)-n1c(C)nc2n(ncc2c1=O)-c1ccccc1Cl
InChI Key InChIKey=GLPGZIANWMCPGK-UHFFFAOYSA-N
Data  1 IC50
  Tab Delimited (TSV)   2D SDfile   Computed 3D by Vconf -m prep SDfile
Find this compound or compounds like it in BindingDB:
Activity Spreadsheet -- Enzyme Inhibition Constant Data from BindingDB
Found 1 hit for monomerid = 40861
TargetComplement C1s subcomponent(Homo sapiens (Human))
Pcmd
Curated by PubChem BioAssay
LigandPNGBDBM40861(1-(2-chlorophenyl)-5-[4-(4-ethyl-1-piperazinyl)phe...)
Affinity DataIC50: >5.00E+4nM. Assay description: Molecular Library Screening Center Network (MLSCN) Penn Center for Molecular Discovery (PCMD) Assay Provider: Dr. Scott L. Diamond, University of Pen...
In DepthDetails PCBioAssay