BDBM408763 (2S,5R)-5-(2-chlorophenyl)-1-(1-(4-nitrophenyl)piperidine-4-carbonyl)pyrrolidine-2-carboxylic acid ::US10358416, Compound 382::US10781171, Compound 382
SMILES OC(=O)[C@@H]1CC[C@@H](N1C(=O)C1CCN(CC1)c1ccc(cc1)[N+]([O-])=O)c1ccccc1Cl
InChI Key InChIKey=TWJSOLAQEIEIOI-RTWAWAEBSA-N
Data  2 KI
  Tab Delimited (TSV)   2D SDfile   Computed 3D by Vconf -m prep SDfile
Find this compound or compounds like it in BindingDB:
Activity Spreadsheet -- Enzyme Inhibition Constant Data from BindingDB
Found 2 hits for monomerid = 408763
TargetFree fatty acid receptor 2(Homo sapiens (Human))
Epics Therapeutics
US Patent
LigandPNGBDBM408763( (2S,5R)-5-(2-chlorophenyl)-1-(1-(4-nitrophenyl)pi...)
Affinity DataKi: >1.00E+3nM. Assay description: The [35S]GTPγS assay was incubated in 20 mM HEPES pH7.4, 100 mM NaCl, 10 μg/ml saponin, 30 mM of MgCl2, 10 μM of GDP, 5 μg membra...
Ligand InfoPC cidPC sid
In DepthDetails US Patent
TargetFree fatty acid receptor 2(Homo sapiens (Human))
Epics Therapeutics
US Patent
LigandPNGBDBM408763( (2S,5R)-5-(2-chlorophenyl)-1-(1-(4-nitrophenyl)pi...)
Affinity DataKi: >2.00E+3nM. Assay description: Human GPR43 radioligand binding assay is performed by adding successively in the wells of a 96 well plate (Master Block, Greiner, 786201), 50 ul of c...
Ligand InfoPC cidPC sid
In DepthDetails US Patent