BDBM40890 4-{[(acetylamino)carbonyl]amino}tetrahydro-3-thienyl acetate::MLS000060901::SMR000069129::[4-(acetylcarbamoylamino)thiolan-3-yl] acetate::[4-(ethanoylcarbamoylamino)thiolan-3-yl] ethanoate::acetic acid [4-(acetylcarbamoylamino)tetrahydrothiophen-3-yl] ester::acetic acid [4-[[acetamido(oxo)methyl]amino]-3-thiolanyl] ester::cid_2832895
SMILES CC(=O)NC(=O)NC1CSCC1OC(C)=O
InChI Key InChIKey=OWXRNMADXPMIAB-UHFFFAOYSA-N
Data  1 IC50
  Tab Delimited (TSV)   2D SDfile   Computed 3D by Vconf -m prep SDfile
Find this compound or compounds like it in BindingDB:
Activity Spreadsheet -- Enzyme Inhibition Constant Data from BindingDB
Found 1 hit for monomerid = 40890
TargetComplement C1s subcomponent(Homo sapiens (Human))
Pcmd
Curated by PubChem BioAssay
LigandPNGBDBM40890(4-{[(acetylamino)carbonyl]amino}tetrahydro-3-thien...)
Affinity DataIC50: >5.00E+4nM. Assay description: Molecular Library Screening Center Network (MLSCN) Penn Center for Molecular Discovery (PCMD) Assay Provider: Dr. Scott L. Diamond, University of Pen...
In DepthDetails PCBioAssay