BDBM40897 MLS000100375::N-(4-methoxy-6-methyl-2-pyrimidinyl)benzenesulfonamide::N-(4-methoxy-6-methyl-pyrimidin-2-yl)benzenesulfonamide::N-(4-methoxy-6-methylpyrimidin-2-yl)benzenesulfonamide::SMR000082694::cid_778472
SMILES COc1cc(C)nc(NS(=O)(=O)c2ccccc2)n1
InChI Key InChIKey=ZYCLWFHJQNMCSK-UHFFFAOYSA-N
Data  1 IC50
  Tab Delimited (TSV)   2D SDfile   Computed 3D by Vconf -m prep SDfile
Find this compound or compounds like it in BindingDB:
Activity Spreadsheet -- Enzyme Inhibition Constant Data from BindingDB
Found 1 hit for monomerid = 40897
TargetComplement C1s subcomponent(Homo sapiens (Human))
Pcmd
Curated by PubChem BioAssay
LigandPNGBDBM40897(MLS000100375 | N-(4-methoxy-6-methyl-2-pyrimidinyl...)
Affinity DataIC50: >5.00E+4nM. Assay description: Molecular Library Screening Center Network (MLSCN) Penn Center for Molecular Discovery (PCMD) Assay Provider: Dr. Scott L. Diamond, University of Pen...
In DepthDetails PCBioAssay