BDBM40905 MLS000118585::N-(2-chlorobenzyl)-2-[[5-[(2-keto-1,3-benzothiazol-3-yl)methyl]-4-methyl-1,2,4-triazol-3-yl]thio]acetamide::N-[(2-chlorophenyl)methyl]-2-[[4-methyl-5-[(2-oxidanylidene-1,3-benzothiazol-3-yl)methyl]-1,2,4-triazol-3-yl]sulfanyl]ethanamide::N-[(2-chlorophenyl)methyl]-2-[[4-methyl-5-[(2-oxo-1,3-benzothiazol-3-yl)methyl]-1,2,4-triazol-3-yl]sulfanyl]acetamide::N-[(2-chlorophenyl)methyl]-2-[[4-methyl-5-[(2-oxo-1,3-benzothiazol-3-yl)methyl]-1,2,4-triazol-3-yl]thio]acetamide::SMR000095526::cid_5307259
SMILES Cn1c(Cn2c3ccccc3sc2=O)nnc1SCC(=O)NCc1ccccc1Cl
InChI Key InChIKey=HVZWJMJIRJUVQY-UHFFFAOYSA-N
Data  1 IC50
  Tab Delimited (TSV)   2D SDfile   Computed 3D by Vconf -m prep SDfile
Find this compound or compounds like it in BindingDB:
Activity Spreadsheet -- Enzyme Inhibition Constant Data from BindingDB
Found 1 hit for monomerid = 40905
TargetComplement C1s subcomponent(Homo sapiens (Human))
Pcmd
Curated by PubChem BioAssay
LigandPNGBDBM40905(MLS000118585 | N-(2-chlorobenzyl)-2-[[5-[(2-keto-1...)
Affinity DataIC50: >5.00E+4nM. Assay description: Molecular Library Screening Center Network (MLSCN) Penn Center for Molecular Discovery (PCMD) Assay Provider: Dr. Scott L. Diamond, University of Pen...
In DepthDetails PCBioAssay