BDBM41021 (3Z)-3-(p-anisidinomethylene)oxindole::(3Z)-3-[(4-methoxyanilino)methylidene]-1H-indol-2-one::(3Z)-3-[[(4-methoxyphenyl)amino]methylidene]-1H-indol-2-one::3-{[(4-methoxyphenyl)amino]methylene}-1,3-dihydro-2H-indol-2-one::MLS000530407::SMR000135384::cid_5657027
SMILES COc1ccc(cc1)N=CC1C(=O)Nc2ccccc12
InChI Key InChIKey=SFJOKEDKKKIQAU-UHFFFAOYSA-N
Data  2 IC50
  Tab Delimited (TSV)   2D SDfile   Computed 3D by Vconf -m prep SDfile
Find this compound or compounds like it in BindingDB:
Activity Spreadsheet -- Enzyme Inhibition Constant Data from BindingDB
Found 2 hits for monomerid = 41021
TargetProtein-tyrosine kinase 2-beta(Homo sapiens (Human))
The Scripps Research Institute Molecular Screening Center
Curated by PubChem BioAssay
LigandPNGBDBM41021((3Z)-3-(p-anisidinomethylene)oxindole | (3Z)-3-[(4...)
Affinity DataIC50:  5.50E+3nM. Assay description: Source (MLPCN Center Name): The Scripps Research Institute Molecular Screening Center (SRIMSC) Affiliation: The Scripps Research Institute, TSRI Assa...
In DepthDetails PCBioAssay
TargetFocal adhesion kinase 1(Homo sapiens (Human))
The Scripps Research Institute Molecular Screening Center
Curated by PubChem BioAssay
LigandPNGBDBM41021((3Z)-3-(p-anisidinomethylene)oxindole | (3Z)-3-[(4...)
Affinity DataIC50:  3.02E+3nM. Assay description: Source (MLSCN Center Name): The Scripps Research Institute Molecular Screening Center Center Affiliation: The Scripps Research Institute, TSRI Assa...
In DepthDetails PCBioAssay